{"text_format":"1","workbook":"xlsx","n_sheets":15,"sheets":["Instructions","Summary","6m","4m","2m","70cm","23cm","13cm","9cm","6cm","3cm","1.2cm","0.6cm","0.4cm","0.2cm"],"not_rendered":{"charts":0,"images":4,"macros":1,"external_links":0,"defined_names":15,"comments":2,"pivot_tables":0},"unopened":[],"bounds":{"document_bytes":16777216,"sheet_cells":100000,"rows_first":2000,"rows_last":500,"rows_between":2000,"halvings":0,"cell_chars":16384,"cell_head_chars":4096},"cells_cut":0,"cells_raw":0,"read":"whole","date_system":"1900"}

{"sheet":"Instructions","index":0,"n_rows":50,"n_cols":4,"rows_kept":50,"cut":false,"hidden":false,"merged":[[45,2,45,3],[6,2,6,3],[10,1,10,3],[14,1,14,3],[41,2,41,3]]}
[]
[null,"Note:"]
[null,{"$f":"IF(Summary!$V$3=1,\"Questo Log del Contest ATV può essere tradotto in altre lingue.\",\"This ATV contest log may be translated to other languages.\")","v":"Questo Log del Contest ATV può essere tradotto in altre lingue."}]
[null,{"$f":"IF(Summary!$V$3=1,\"Tuttavia, le formule e le posizioni delle celle non dovrebbero essere modificate.\",\"However, the formulas and positions of cells should not be changed.\")","v":"Tuttavia, le formule e le posizioni delle celle non dovrebbero essere modificate."}]
[]
[null,{"$f":"IF(Summary!$V$3=1,\"Gentile Concorrente,\",\"Dear Contester,\")","v":"Gentile Concorrente,"}]
[]
[null,{"$f":"IF(Summary!$V$3=1,\"Questo foglio excel deve essere utilizzato per i Log ed inviato come iscrizione al Contest ATV - Triveneto.\",\"This spreadsheet should be used to log and submit your entry for the Triveneto - ATV contest.\")","v":"Questo foglio excel deve essere utilizzato per i Log ed inviato come iscrizione al Contest ATV - Triveneto."}]
[]
[null,{"$f":"IF(Summary!$V$3=1,\"Controlla gli ultimi regolamenti del Contest IARU ATV, in particolare per i dettagli del codice a quattro cifre.\",\"Check the latest IARU ATV contest regulations, especially for details of the four digit code.\")","v":"Controlla gli ultimi regolamenti del Contest IARU ATV, in particolare per i dettagli del codice a quattro cifre."}]
[null,"https://www.iaru-r1.org/wp-content/uploads/2019/08/ATV-Contest-rules.pdf"]
[null,{"$f":"IF(Summary!$V$3=1,\"Il foglio excel calcola correttamente con 6, 8 o 10 locatori di caratteri. È possibile utilizzare formati misti.\",\"The spreadsheet calculates correctly with 6, 8 or 10 character locators. Mixed formats can be used.\")","v":"Il foglio excel calcola correttamente con 6, 8 o 10 locatori di caratteri. È possibile utilizzare formati misti."}]
[null,{"$f":"IF(Summary!$V$3=1,\"La posizione esatta della stazione nell'area del locatore, influenzerà la distanza effettiva.\",\"The exact position of the station in the square will influence the actual distance.\")","v":"La posizione esatta della stazione nell'area del locatore, influenzerà la distanza effettiva."}]
[null,{"$f":"IF(Summary!$V$3=1,\"La tua posizione esatta può essere trovata ad esempio nel seguente sito web:\",\"Your exact location can be found for example in the following website:\")","v":"La tua posizione esatta può essere trovata ad esempio nel seguente sito web:"}]
[null,"http://k7fry.com/grid/"]
[]
[null,{"$f":"IF(Summary!$V$3=1,\"Questo foglio excel può essere utilizzato anche per concorsi ATV subregionali, previa accettazione da parte del responsabile del concorso ATV locale.\",\"This spreadsheet can also be used for subregional ATV contests, subject to acceptance by your local ATV contest manager.\")","v":"Questo foglio excel può essere utilizzato anche per concorsi ATV subregionali, previa accettazione da parte del responsabile del concorso ATV locale."}]
[]
[null,{"$f":"IF(Summary!$V$3=1,\"Procedi con i seguenti passaggi per compilare il documento:\",\"Proceed with following steps to fill in the document:\")","v":"Procedi con i seguenti passaggi per compilare il documento:"}]
[]
[null,null,{"$f":"IF(Summary!$V$3=1,\"Quando si apre questo documento, le macro dovrebbero essere abilitate per consentire a tutte le funzionalità di funzionare.\",\"When opening this document, macros should be enabled to alow all the features to work.\")","v":"Quando si apre questo documento, le macro dovrebbero essere abilitate per consentire a tutte le funzionalità di funzionare."}]
[]
[null,null,"1)",{"$f":"IF(Summary!$V$3=1,\"Salva il file come ATV_tuonominativo_AAAAMMGG in una posizione file che puoi ritrovare.\",\"Save the file as ATV_yourcall_YYYYMMDD at a file location you can find again.\")","v":"Salva il file come ATV_tuonominativo_AAAAMMGG in una posizione file che puoi ritrovare."}]
[null,null,null,{"$f":"IF(Summary!$V$3=1,\"Durante l'utilizzo: salva per evitare la perdita di dati.\",\"During usage: save to prevent loss of data.\")","v":"Durante l'utilizzo: salva per evitare la perdita di dati."}]
[]
[null,null,"2) ",{"$f":"IF(Summary!$V$3=1,\"Foglio 'Summary' Sommario\",\"Summary sheet:\")","v":"Foglio 'Summary' Sommario"}]
[null,null,"   ",{"$f":"IF(Summary!$V$3=1,\"Inserisci i tuoi dati personali nel foglio 'Summary' prima del Contest.\",\"Fill in your personal details on summary sheet before the contest.\")","v":"Inserisci i tuoi dati personali nel foglio 'Summary' prima del Contest."}]
[null,null,null,{"$f":"IF(Summary!$V$3=1,\"Compila solo i campi con sfondo bianco.\",\"Fill in only fields in white background.\")","v":"Compila solo i campi con sfondo bianco."}]
[null,null,null,{"$f":"IF(Summary!$V$3=1,\"I campi in giallo chiaro vengono calcolati automaticamente.\",\"Light yellow fields are automatically computed.\")","v":"I campi in giallo chiaro vengono calcolati automaticamente."}]
[]
[null,null,"3) ",{"$f":"IF(Summary!$V$3=1,\"Ci sono 'schede/fogli excel' per ogni banda\",\"There are tabs for each band:\")","v":"Ci sono 'schede/fogli excel' per ogni banda"}]
[null,null,null,{"$f":"IF(Summary!$V$3=1,\"Durante il contest, compila i log per ciascuna banda.\",\"During the contest, fill in the logs per band.\")","v":"Durante il contest, compila i log per ciascuna banda."}]
[null,null,null,{"$f":"IF(Summary!$V$3=1,\"Ricordati di inserire l'ora in UTC!\",\"Remember to fill in the time in UTC!\")","v":"Ricordati di inserire l'ora in UTC!"}]
[null,null,null,{"$f":"IF(Summary!$V$3=1,\"Compila solo i campi con sfondo bianco.\",\"Fill in only fields in white background.\")","v":"Compila solo i campi con sfondo bianco."}]
[null,null,null,{"$f":"IF(Summary!$V$3=1,\"I campi in giallo chiaro vengono calcolati automaticamente.\",\"Light yellow fields are automatically computed.\")","v":"I campi in giallo chiaro vengono calcolati automaticamente."}]
[]
[null,null,"4) ",{"$f":"IF(Summary!$V$3=1,\"Dopo il contest, controlla i dati calcolati 'strani' ed una volta che hai compilato tutto correttamente, completa il foglio 'Summary' con la data ed il tuo nome 'in fondo al foglio'.\",\"After the contest, check for 'strange' calculated data and once you have everyting correct filled in, complete the summary sheet with the date and your name (at the bottom of the sheet).\")","v":"Dopo il contest, controlla i dati calcolati 'strani' ed una volta che hai compilato tutto correttamente, completa il foglio 'Summary' con la data ed il tuo nome 'in fondo al foglio'."}]
[null,null,null,{"$f":"IF(Summary!$V$3=1,\"SALVA!\",\"SAVE!\")","v":"SALVA!"}]
[]
[null,null,{"$f":"IF(Summary!$V$3=1,\"Invia il file al tuo responsabile del Contest ATV locale prima della data di chiusura e chiedi conferma di ricezione.\",\"Send the file to your local ATV contest manager before the closing date and ask for confirmation of receipt.\")","v":"Invia il file al tuo responsabile del Contest ATV locale prima della data di chiusura e chiedi conferma di ricezione."}]
[null,null,{"$f":"IF(Summary!$V$3=1,\"Indirizzo e-mail del tuo manager ATV locale:\",\"Email address of your local ATV manager:\")","v":"Indirizzo e-mail del tuo manager ATV locale:"}]
[null,null,"contest@aritreviso.it"]
[]
[]
[]
[]
[]
[null,{"$f":"IF(Summary!$V$3=1,\"Buona fortuna con il Contest!\",\"Good luck with the contest !\")","v":"Buona fortuna con il Contest!"}]
[]
[null,{"$f":"IF(Summary!$V$3=1,\"Versione 5a 2021\",\"Version 5a - 2021\")","v":"Versione 5a 2021"}]

{"sheet":"Summary","index":1,"n_rows":70,"n_cols":35,"rows_kept":70,"cut":false,"hidden":false,"merged":[[66,0,66,16],[67,0,68,16],[1,17,1,19],[16,1,16,3],[34,1,34,2],[59,1,59,4],[61,1,61,4],[14,1,14,3],[8,1,8,3],[12,1,12,3],[10,1,10,3],[2,1,2,3],[4,1,4,3],[6,1,6,3],[0,0,0,12]]}
[{"$f":"IF($V$3=1,\" SOMMARIO - 2° ATV CONTEST - Triveneto Edizione 2022\",\"2° ATV Contest Triveneto Edition 2022 - Summary\")","v":" SOMMARIO - 2° ATV CONTEST - Triveneto Edizione 2022"}]
[null,null,null,null,null,null,null,null,null,null,null,null,null,null,null,null,null,{"$f":"IF($V$3=1,\"Lingua\",\"Language\")","v":"Lingua"}]
[{"$f":"IF($V$3=1,\"Data Contest\",\"Contest Date\")","v":"Data Contest"},"2022-07-10",null,null,null,null,null,null,null,null,null,null,null,null,null,null,null,null,null,null,null,1]
[]
[{"$f":"IF($V$3=1,\"NOMINATIVO\",\"CALL\")","v":"NOMINATIVO"}]
[]
[{"$f":"IF($V$3=1,\"NOME\",\"NAME\")","v":"NOME"}]
[]
[{"$f":"IF($V$3=1,\"INDIRIZZO\",\"ADDRESS\")","v":"INDIRIZZO"}]
[]
[{"$f":"IF($V$3=1,\"CITTA' - CAP - NAZIONE\",\"CITY - ZIP CODE - COUNTRY\")","v":"CITTA' - CAP - NAZIONE"}]
[]
[{"$f":"IF($V$3=1,\"Indirizzo Email\",\"Email address\")","v":"Indirizzo Email"}]
[]
[{"$f":"IF($V$3=1,\"Locatore WW\",\"WW Locator\")","v":"Locatore WW"}]
[]
[{"$f":"IF($V$3=1,\"Selezionare >>\",\"Choice >>\")","v":"Selezionare >>"},"OM",null,null,null,null,null,null,null,null,null,null,null,null,null,null,null,null,null,null,null,"OM"]
[null,null,null,null,null,null,null,null,null,null,null,null,null,null,null,null,null,null,null,null,null,"SWL"]
[null,{"$f":"IF($V$3=1,\"Codice a 4 cifre scelto\",\"Four digit code used\")","v":"Codice a 4 cifre scelto"}]
["6 m - 50Mhz",null,null,null,null,"Section 1 - Home QTH"]
["4 m (UK only)"]
["2 m - 144 Mhz"]
["70 cm  - 430 Mhz"]
["23 cm - 1296 Mhz"]
["13 cm - 2400 Mhz"]
["9 cm - 3 Ghz"]
["6 cm  - 5 Ghz"]
["3 cm  - 10 Ghz"]
["1,2 cm  - 25 Ghz"]
["0,6 cm - 50 Ghz"]
["0,4 cm - 75 Ghz"]
["0,2 cm - 150 Ghz"]
[null,null,null,null,null,null,null,null,null,null,null,null,null,null,null,null,null,null,null,null,null,null,null,null,null,null,null,null,null,null,null,null,null,null,"Moltipplicatori"]
[]
[null,{"$f":"IF($V$3=1,\"Punteggio\",\"Score\")","v":"Punteggio"},null,{"$f":"IF($V$3=1,\"Miglior DX\",\"Best DX\")","v":"Miglior DX"},"km",{"$f":"IF($V$3=1,\"Locatore WW\",\"WW Locator\")","v":"Locatore WW"},null,null,{"$f":"IF($V$3=1,\"n. QSO\",\"QSOs\")","v":"n. QSO"},{"$f":"IF($V$3=1,\"Km Totali\",\"Total km\")","v":"Km Totali"},{"$f":"IF($V$3=1,\"Media\",\"average\")","v":"Media"}]
[null,"Analogico","Digitale"]
["6 m - 50Mhz",{"$f":"'6m'!P4","v":0},{"$f":"'6m'!P8","v":0},{"$f":"VLOOKUP(MAX('6m'!BA12:BA61),'6m'!BA12:BC61,2,FALSE)","v":0},{"$f":"MAX('6m'!BA12:BA61)","v":0},{"$f":"VLOOKUP(MAX('6m'!BA12:BA61),'6m'!BA12:BC61,3,FALSE)","v":0},null,null,{"$f":"'6m'!BD12","v":0},{"$f":"'6m'!BE12","v":0},{"$f":"IF(J37>0,J37/I37,0)","v":0},null,null,null,null,null,null,null,null,null,null,null,null,null,null,null,null,null,null,null,null,null,null,{"$f":"A37","v":"6 m - 50Mhz"},2]
["4 m (UK only)",{"$f":"'4m'!P4","v":0},null,{"$f":"VLOOKUP(MAX('4m'!BA12:BA61),'4m'!BA12:BC61,2,FALSE)","v":0},{"$f":"MAX('4m'!BA12:BA61)","v":0},{"$f":"VLOOKUP(MAX('4m'!BA12:BA61),'4m'!BA12:BC61,3,FALSE)","v":0},null,null,{"$f":"'4m'!BD12","v":0},{"$f":"'4m'!BE12","v":0},{"$f":"IF(J38>0,J38/I38,0)","v":0},null,null,null,null,null,null,null,null,null,null,null,null,null,null,null,null,null,null,null,null,null,null,{"$f":"A38","v":"4 m (UK only)"},0]
["2 m - 144 Mhz",{"$f":"'2m'!P4","v":0},{"$f":"'2m'!P8","v":0},{"$f":"VLOOKUP(MAX('2m'!BA12:BA61),'2m'!BA12:BC61,2,FALSE)","v":0},{"$f":"MAX('2m'!BA12:BA61)","v":0},{"$f":"VLOOKUP(MAX('2m'!BA12:BA61),'2m'!BA12:BC61,3,FALSE)","v":0},null,null,{"$f":"'2m'!BD12","v":0},{"$f":"'2m'!BE12","v":0},{"$f":"IF(J39>0,J39/I39,0)","v":0},null,null,null,null,null,null,null,null,null,null,null,null,null,null,null,null,null,null,null,null,null,null,"2 m - 144 Mhz",2]
["70 cm  - 430 Mhz",{"$f":"'70cm'!P4","v":0},{"$f":"'70cm'!P8","v":0},{"$f":"VLOOKUP(MAX('70cm'!BA12:BA61),'70cm'!BA12:BC61,2,FALSE)","v":0},{"$f":"MAX('70cm'!BA12:BA61)","v":0},{"$f":"VLOOKUP(MAX('70cm'!BA12:BA61),'70cm'!BA12:BC61,3,FALSE)","v":0},null,null,{"$f":"'70cm'!BD12","v":0},{"$f":"'70cm'!BE12","v":0},{"$f":"IF(J40>0,J40/I40,0)","v":0},null,null,null,null,null,null,null,null,null,null,null,null,null,null,null,null,null,null,null,null,null,null,"70 cm  - 430 Mhz",8]
["23 cm - 1296 Mhz",{"$f":"'23cm'!P4","v":0},{"$f":"'23cm'!P8","v":0},{"$f":"VLOOKUP(MAX('23cm'!BA12:BA61),'23cm'!BA12:BC61,2,FALSE)","v":0},{"$f":"MAX('23cm'!BA12:BA61)","v":0},{"$f":"VLOOKUP(MAX('23cm'!BA12:BA61),'23cm'!BA12:BC61,3,FALSE)","v":0},null,null,{"$f":"'23cm'!BD12","v":0},{"$f":"'23cm'!BE12","v":0},{"$f":"IF(J41>0,J41/I41,0)","v":0},null,null,null,null,null,null,null,null,null,null,null,null,null,null,null,null,null,null,null,null,null,null,"23 cm - 1296 Mhz",2]
["13 cm - 2400 Mhz",{"$f":"'13cm'!P4","v":0},{"$f":"'13cm'!P8","v":0},{"$f":"VLOOKUP(MAX('13cm'!BA12:BA61),'13cm'!BA12:BC61,2,FALSE)","v":0},{"$f":"MAX('13cm'!BA12:BA61)","v":0},{"$f":"VLOOKUP(MAX('13cm'!BA12:BA61),'13cm'!BA12:BC61,3,FALSE)","v":0},null,null,{"$f":"'13cm'!BD12","v":0},{"$f":"'13cm'!BE12","v":0},{"$f":"IF(J42>0,J42/I42,0)","v":0},null,null,null,null,null,null,null,null,null,null,null,null,null,null,null,null,null,null,null,null,null,null,"13 cm - 2400 Mhz",4]
["9 cm - 3 Ghz",{"$f":"'9cm'!P4","v":0},{"$f":"'9cm'!P8","v":0},{"$f":"VLOOKUP(MAX('9cm'!BA12:BA61),'9cm'!BA12:BC61,2,FALSE)","v":0},{"$f":"MAX('9cm'!BA12:BA61)","v":0},{"$f":"VLOOKUP(MAX('9cm'!BA12:BA61),'9cm'!BA12:BC61,3,FALSE)","v":0},null,null,{"$f":"'9cm'!BD12","v":0},{"$f":"'9cm'!BE12","v":0},0,null,null,null,null,null,null,null,null,null,null,null,null,null,null,null,null,null,null,null,null,null,null,"9 cm - 3 Ghz",8]
["6 cm  - 5 Ghz",{"$f":"'6cm'!P4","v":0},{"$f":"'6cm'!P8","v":0},{"$f":"VLOOKUP(MAX('6cm'!BA12:BA61),'6cm'!BA12:BC61,2,FALSE)","v":0},{"$f":"MAX('6cm'!BA12:BA61)","v":0},{"$f":"VLOOKUP(MAX('6cm'!BA12:BA61),'6cm'!BA12:BC61,3,FALSE)","v":0},null,null,{"$f":"'6cm'!BD12","v":0},{"$f":"'6cm'!BE12","v":0},0,null,null,null,null,null,null,null,null,null,null,null,null,null,null,null,null,null,null,null,null,null,null,"6 cm  - 5 Ghz",8]
["3 cm  - 10 Ghz",{"$f":"'3cm'!P4","v":0},{"$f":"'3cm'!P8","v":0},{"$f":"VLOOKUP(MAX('3cm'!BA12:BA61),'3cm'!BA12:BC61,2,FALSE)","v":0},{"$f":"MAX('3cm'!BA12:BA61)","v":0},{"$f":"VLOOKUP(MAX('3cm'!BA12:BA61),'3cm'!BA12:BC61,3,FALSE)","v":0},null,null,{"$f":"'3cm'!BD12","v":0},{"$f":"'3cm'!BE12","v":0},0,null,null,null,null,null,null,null,null,null,null,null,null,null,null,null,null,null,null,null,null,null,null,"3 cm  - 10 Ghz",8]
["1,2 cm  - 25 Ghz",{"$f":"'1.2cm'!P4","v":0},{"$f":"'1.2cm'!P8","v":0},{"$f":"VLOOKUP(MAX('1.2cm'!BA12:BA61),'1.2cm'!BA12:BC61,2,FALSE)","v":0},{"$f":"MAX('1.2cm'!BA12:BA61)","v":0},{"$f":"VLOOKUP(MAX('1.2cm'!BA12:BA61),'1.2cm'!BA12:BC61,3,FALSE)","v":0},null,null,{"$f":"'1.2cm'!BD12","v":0},{"$f":"'1.2cm'!BE12","v":0},0,null,null,null,null,null,null,null,null,null,null,null,null,null,null,null,null,null,null,null,null,null,null,"1,2 cm  - 25 Ghz",10]
["0,6 cm - 50 Ghz",{"$f":"'0.6cm'!P4","v":0},{"$f":"'0.6cm'!P8","v":0},{"$f":"VLOOKUP(MAX('0.6cm'!BA12:BA61),'0.6cm'!BA12:BC61,2,FALSE)","v":0},{"$f":"MAX('0.6cm'!BA12:BA61)","v":0},{"$f":"VLOOKUP(MAX('0.6cm'!BA12:BA61),'0.6cm'!BA12:BC61,3,FALSE)","v":0},null,null,{"$f":"'0.6cm'!BD12","v":0},{"$f":"'0.6cm'!BE12","v":0},0,null,null,null,null,null,null,null,null,null,null,null,null,null,null,null,null,null,null,null,null,null,null,"0,6 cm - 50 Ghz",10]
["0,4 cm - 75 Ghz",{"$f":"'0.4cm'!P4","v":0},{"$f":"'0.4cm'!P8","v":0},{"$f":"VLOOKUP(MAX('0.4cm'!BA12:BA61),'0.4cm'!BA12:BC61,2,FALSE)","v":0},{"$f":"MAX('0.4cm'!BA12:BA61)","v":0},{"$f":"VLOOKUP(MAX('0.4cm'!BA12:BA61),'0.4cm'!BA12:BC61,3,FALSE)","v":0},null,null,{"$f":"'0.4cm'!BD12","v":0},{"$f":"'0.4cm'!BE12","v":0},0,null,null,null,null,null,null,null,null,null,null,null,null,null,null,null,null,null,null,null,null,null,null,"0,4 cm - 75 Ghz",10]
["0,2 cm - 150 Ghz",{"$f":"'0.2cm'!P4","v":0},{"$f":"'0.2cm'!P8","v":0},{"$f":"VLOOKUP(MAX('0.2cm'!BA12:BA61),'0.2cm'!BA12:BC61,2,FALSE)","v":0},{"$f":"MAX('0.2cm'!BA12:BA61)","v":0},{"$f":"VLOOKUP(MAX('0.2cm'!BA12:BA61),'0.2cm'!BA12:BC61,3,FALSE)","v":0},null,null,{"$f":"'0.2cm'!BD12","v":0},{"$f":"'0.2cm'!BE12","v":0},0,null,null,null,null,null,null,null,null,null,null,null,null,null,null,null,null,null,null,null,null,null,null,"0,2 cm - 150 Ghz",10]
["Parziale",{"$f":"SUM(B37:B49)","v":0},{"$f":"SUM(C37:C49)","v":0},null,null,null,null,null,null,null,null,null,null,null,null,null,null,null,null,null,null,null,null,null,null,null,null,null,null,null,null,null,null,"Parziale"]
[]
["Total IARU Points",{"$f":"SUM(B40:B49)","v":0}]
[{"$f":"IF($V$3=1,\"Punteggio Tot.\",\"Total Point\")","v":"Punteggio Tot."},{"$f":"+B50+C50","v":0}]
[]
[]
[{"$f":"IF($V$3=1,\"Dichiaro di aver seguito le regole e lo spirito del Contest\",\"I hereby declare that I followed the rules and the spirit of the contest\")","v":"Dichiaro di aver seguito le regole e lo spirito del Contest"}]
[{"$f":"IF($V$3=1,\"Dichiaro inoltre di essere a conoscenza del trattamento dei dati personali come di seguito indicato\",\"Furthermore I declare that I am familiar with the processing of personal data as indicated below\")","v":"Dichiaro inoltre di essere a conoscenza del trattamento dei dati personali come di seguito indicato"}]
[]
[]
[{"$f":"IF($V$3=1,\"Data\",\"Date\")","v":"Data"}]
[]
[{"$f":"IF($V$3=1,\"Firma (nome)\",\"Signature (name)\")","v":"Firma (nome)"}]
[]
[]
[]
[{"$f":"IF($V$3=1,\"Dopo l'invio, questo Log verrà archiviato ed elaborato dai gestori di contest ATV nazionali ed internazionali.\",\"After submission, this log will be stored and processed by National and International ATV Contest Managers.\")","v":"Dopo l'invio, questo Log verrà archiviato ed elaborato dai gestori di contest ATV nazionali ed internazionali."}]
[{"$f":"IF($V$3=1,\"I gestori del Contest si impegnano a proteggere i dati in conformità con le normative comunitarie o nazionali (a seconda di quale sia la più restrittiva).\",\"The Contest Managers undertake to protect the data in accordance with EU or national regulations (whichever is the most restrictive).\")","v":"I gestori del Contest si impegnano a proteggere i dati in conformità con le normative comunitarie o nazionali (a seconda di quale sia la più restrittiva)."}]
[{"$f":"IF($V$3=1,\"Con l'invio del Log, il partecipante acconsente a tale elaborazione e acconsente anche alla pubblicazione dei risultati del Contest sui siti Web e su riviste di settore.\",\"By submission of the log, the participant agrees to this processing, and also agrees to the publication of summaries of the contest results on relevant websites and printed media.\")","v":"Con l'invio del Log, il partecipante acconsente a tale elaborazione e acconsente anche alla pubblicazione dei risultati del Contest sui siti Web e su riviste di settore."}]
[]
["Section 2 - Roving"]

{"sheet":"6m","index":2,"n_rows":62,"n_cols":57,"rows_kept":62,"cut":false,"hidden":false,"merged":[[5,2,5,7],[7,2,7,3],[7,9,7,10],[0,0,0,16],[7,7,7,8],[9,16,10,16],[9,1,10,1],[9,2,10,2],[9,3,10,5],[9,6,10,8],[9,9,10,9],[9,10,10,10],[9,11,10,11],[9,12,10,12],[9,13,10,13],[9,14,10,14],[9,15,10,15],[9,0,10,0],[3,6,3,8]]}
["ATV CONTEST LOG  6 m"]
[]
[]
[null,null,null,null,null,null,null,null,null,null,null,{"$f":"IF(Summary!$V$3=1,\"Banda:\",\"Band:\")","v":"Banda:"},6," m",{"$f":"IF(Summary!$V$3=1,\"Analogico:\",\"Analogic\")","v":"Analogico:"},{"$f":"SUMIF($R$12:$R$61,\"=FALSO\",$N$12:$N$61)","v":0},null,null,null,null,null,null,null,null,"Deg/Rad :",{"$f":"180/PI()","v":57.295779513082323}]
[]
[{"$f":"IF(Summary!$V$3=1,\"Data:\",\"Date:\")","v":"Data:"},null,{"$f":"IF(Summary!B3=\"\",\"\",Summary!B3)","v":"2022-07-10"},null,null,null,null,null,null,null,null,{"$f":"IF(Summary!$V$3=1,\"Moltiplicatore:\",\"Multiplier:\")","v":"Moltiplicatore:"},{"$f":"Summary!$AI$37","v":2},null,{"$f":"IF(Summary!$V$3=1,\"Totale:\",\"Total:\")","v":"Totale:"},{"$f":"SUM(N12:N61)","v":0},{"$f":"IF(M4=70,1,IF(M4=24,2,IF(M4=23,2,IF(M4=13,5))))","v":false},{"$f":"IF(M4=9,\"5\",IF(M4=6,\"5\",IF(M4=3,\"5\",IF(M4=1.3,\"5\"))))","v":"5"},{"$f":"IF(M4=1.2,\"5\",IF(M4=0.6,\"5\",IF(M4=0.7,\"5\")))","v":false},"Longitude",null,null,null,"Latitude"]
[]
[{"$f":"IF(Summary!$V$3=1,\"Codice:\",\"Code:\")","v":"Codice:"},null,{"$f":"Summary!$B$20","v":0},null,null,null,null,{"$f":"IF(Summary!$V$3=1,\"Nominativo:\",\"Call:\")","v":"Nominativo:"},null,{"$f":"Summary!B5","v":0},null,{"$f":"IF(Summary!$V$3=1,\"Locatore WW:\",\"WW Locator:\")","v":"Locatore WW:"},{"$f":"Summary!B15","v":0},null,{"$f":"IF(Summary!$V$3=1,\"Digitale:\",\"Digital:\")","v":"Digitale:"},{"$f":"SUMIF($R$12:$R$61,\"=VERO\",$N$12:$N$61)","v":0},null,null,null,0,null,null,null,0]
[]
[{"$f":"IF(Summary!$V$3=1,\"Data\",\"Date\")","v":"Data"},{"$f":"IF(Summary!$V$3=1,\"Ora UTC\",\"Time UTC\")","v":"Ora UTC"},{"$f":"IF(Summary!$V$3=1,\"Stazioni Collegate\",\"Stations Worked\")","v":"Stazioni Collegate"},{"$f":"IF(Summary!$V$3=1,\"Rprt.+ Sequenza Ricevuta\",\"Rprt.+ Sequence Received\")","v":"Rprt.+ Sequenza Ricevuta"},null,null,{"$f":"IF(Summary!$V$3=1,\"Rpt.+ Sequenza Inviata\",\"Rpt.+ Sequence Sent\")","v":"Rpt.+ Sequenza Inviata"},null,null,{"$f":"IF(Summary!$V$3=1,\"Codice Ricevuto\",\"Code Received\")","v":"Codice Ricevuto"},{"$f":"IF(Summary!$V$3=1,\"Locatore WW\",\"WW Locator\")","v":"Locatore WW"},{"$f":"IF(Summary!$V$3=1,\"Commenti\",\"Comments\")","v":"Commenti"},{"$f":"IF(Summary!$V$3=1,\"Distanza Km\",\"Distance Km\")","v":"Distanza Km"},{"$f":"IF(Summary!$V$3=1,\"Punti\",\"Points\")","v":"Punti"},{"$f":"IF(Summary!$V$3=1,\"AZIMUT (Tuo)\",\"Heading (own)\")","v":"AZIMUT (Tuo)"},{"$f":"IF(Summary!$V$3=1,\"AZIMUT (Corrispondente)\",\"Heading (Other)\")","v":"AZIMUT (Corrispondente)"},{"$f":"IF(Summary!$V$3=1,\"DIGITALE?\",\"DIGITAL?\")","v":"DIGITALE?"},null,null,null,null,null,null,null,"Local Lat","Dist Lat","Diff Long",null,"Path Rad",null,null,null,null,null,null,null,null,null,null,"Dist Lat","Local Lat","Diff Long",null,"Path Rad",null,null,null,null,"Back"]
[null,null,null,null,null,null,null,null,null,null,null,null,null,null,null,null,null,null,null,"Longitude",null,null,null,"Latitude","A","B","L","E","D","Dcond","F1cond","F2cond","F3cond","Bearing",null,"R","Rint   km",null,null,"A","B","L","E","D","Dcond","F1cond","F2cond","F3cond","Bearing",null,null,null,"dx","call","locator","nr. QSO's","total km's"]
[null,null,null,"P",0,null,"P",0,"001",null,null,null,{"$f":"IF(K12<>\"\",AK12,0)","v":0},{"$f":"(IF(E12>1,M12,0)*$M$6/2)+(IF(H12>1,M12,0)*$M$6/2)","v":0},{"$f":"IF(K12<>0,AH12,\"\")","v":""},{"$f":"IF(K12<>0,AW12,\"\")","v":""},null,false,null,0,null,null,null,0,{"$f":"$X$8/$Z$4","v":0},{"$f":"X12/$Z$4","v":0},{"$f":"(T12-$T$8)*2/$Z$4","v":0},{"$f":"SIN(Y12)*SIN(Z12)+COS(Y12)*COS(Z12)*COS(AA12)","v":1},{"$f":"ATAN(SQRT(1-AB12*AB12)/AB12)","v":0},{"$f":"IF(AC12<0,180/$Z$4+AC12,AC12)","v":0},{"$f":"IF(Y12<>Z12,90*(1+ABS(Y12-Z12)/(Y12-Z12)))","v":false},{"$f":"IF(AA12<>0,90+$Z$4*ATAN((SIN(Y12)*AB12-SIN(Z12))/(SIN(AA12)*COS(Y12)^2)),AE12*1)","v":0},{"$f":"IF(SIN(AA12)<0,AF12+180,AF12*1)","v":0},{"$f":"INT(AG12)","v":0},null,{"$f":"6365.11*AD12","v":0},{"$f":"IF(AJ12<5,5,INT(AJ12+0.5))","v":5},null,null,{"$f":"X12/$Z$4","v":0},{"$f":"$X$8/$Z$4","v":0},{"$f":"($T$8-T12)*2/$Z$4","v":0},{"$f":"SIN(AN12)*SIN(AO12)+COS(AN12)*COS(AO12)*COS(AP12)","v":1},{"$f":"ATAN(SQRT(1-AQ12*AQ12)/AQ12)","v":0},{"$f":"IF(AC12<0,180/$Z$4+AC12,AC12)","v":0},{"$f":"IF(AN12<>AO12,90*(1+ABS(AN12-AO12)/(AN12-AO12)))","v":false},{"$f":"IF(AP12<>0,90+$Z$4*ATAN((SIN(AN12)*AQ12-SIN(AO12))/(SIN(AP12)*COS(AN12)^2)),AT12*1)","v":0},{"$f":"IF(SIN(AP12)<0,AU12+180,AU12*1)","v":0},{"$f":"INT(AV12)","v":0},null,null,null,{"$f":"M12","v":0},{"$f":"C12","v":0},{"$f":"K12","v":0},0,0]
[null,null,null,"P",0,null,"P",0,"002",null,null,null,{"$f":"IF(K13<>\"\",AK13,0)","v":0},{"$f":"(IF(E13>1,M13,0)*$M$6/2)+(IF(H13>1,M13,0)*$M$6/2)","v":0},{"$f":"IF(K13<>0,AH13,\"\")","v":""},{"$f":"IF(K13<>0,AW13,\"\")","v":""},null,false,null,0,null,null,null,0,{"$f":"$X$8/$Z$4","v":0},{"$f":"X13/$Z$4","v":0},{"$f":"(T13-$T$8)*2/$Z$4","v":0},{"$f":"SIN(Y13)*SIN(Z13)+COS(Y13)*COS(Z13)*COS(AA13)","v":1},{"$f":"ATAN(SQRT(1-AB13*AB13)/AB13)","v":0},{"$f":"IF(AC13<0,180/$Z$4+AC13,AC13)","v":0},false,{"$f":"IF(AA13<>0,90+$Z$4*ATAN((SIN(Y13)*AB13-SIN(Z13))/(SIN(AA13)*COS(Y13)^2)),AE13*1)","v":0},{"$f":"IF(SIN(AA13)<0,AF13+180,AF13*1)","v":0},{"$f":"INT(AG13)","v":0},null,{"$f":"6365.11*AD13","v":0},5,null,null,0,0,0,1,0,0,false,0,0,0,null,null,null,{"$f":"M13","v":0},{"$f":"C13","v":0},{"$f":"K13","v":0}]
[null,null,null,"P",0,null,"P",0,"003",null,null,null,0,0,{"$f":"IF(K14<>0,AH14,\"\")","v":""},{"$f":"IF(K14<>0,AW14,\"\")","v":""},null,false,null,0,null,null,null,0,0,0,0,1,0,0,false,0,0,0,null,{"$f":"6365.11*AD14","v":0},5,null,null,0,0,0,1,0,0,false,0,0,0,null,null,null,0,0,0]
[null,null,null,"P",0,null,"P",0,"004",null,null,null,0,0,"","",null,false,null,0,null,null,null,0,0,0,0,1,0,0,false,0,0,0,null,0,5,null,null,0,0,0,1,0,0,false,0,0,0,null,null,null,0,0,0]
[null,null,null,"P",0,null,"P",0,"005",null,null,null,0,0,"","",null,false,null,0,null,null,null,0,0,0,0,1,0,0,false,0,0,0,null,0,5,null,null,0,0,0,1,0,0,false,0,0,0,null,null,null,0,0,0]
[null,null,null,"P",0,null,"P",0,"006",null,null,null,0,0,"","",null,false,null,0,null,null,null,0,0,0,0,1,0,0,false,0,0,0,null,0,5,null,null,0,0,0,1,0,0,false,0,0,0,null,null,null,0,0,0]
[null,null,null,"P",0,null,"P",0,"007",null,null,null,0,0,"","",null,false,null,0,null,null,null,0,0,0,0,1,0,0,false,0,0,0,null,0,5,null,null,0,0,0,1,0,0,false,0,0,0,null,null,null,0,0,0]
[null,null,null,"P",0,null,"P",0,"008",null,null,null,0,0,"","",null,false,null,0,null,null,null,0,0,0,0,1,0,0,false,0,0,0,null,0,5,null,null,0,0,0,1,0,0,false,0,0,0,null,null,null,0,0,0]
[null,null,null,"P",0,null,"P",0,"009",null,null,null,0,0,"","",null,false,null,0,null,null,null,0,0,0,0,1,0,0,false,0,0,0,null,0,5,null,null,0,0,0,1,0,0,false,0,0,0,null,null,null,0,0,0]
[null,null,null,"P",0,null,"P",0,"010",null,null,null,0,0,"","",null,false,null,0,null,null,null,0,0,0,0,1,0,0,false,0,0,0,null,0,5,null,null,0,0,0,1,0,0,false,0,0,0,null,null,null,0,0,0]
[null,null,null,"P",0,null,"P",0,"011",null,null,null,0,0,"","",null,false,null,0,null,null,null,0,0,0,0,1,0,0,false,0,0,0,null,0,5,null,null,0,0,0,1,0,0,false,0,0,0,null,null,null,0,0,0]
[null,null,null,"P",0,null,"P",0,"012",null,null,null,0,0,"","",null,false,null,0,null,null,null,0,0,0,0,1,0,0,false,0,0,0,null,0,5,null,null,0,0,0,1,0,0,false,0,0,0,null,null,null,0,0,0]
[null,null,null,"P",0,null,"P",0,"013",null,null,null,0,0,"","",null,false,null,0,null,null,null,0,0,0,0,1,0,0,false,0,0,0,null,0,5,null,null,0,0,0,1,0,0,false,0,0,0,null,null,null,0,0,0]
[null,null,null,"P",0,null,"P",0,"014",null,null,null,0,0,"","",null,false,null,0,null,null,null,0,0,0,0,1,0,0,false,0,0,0,null,0,5,null,null,0,0,0,1,0,0,false,0,0,0,null,null,null,0,0,0]
[null,null,null,"P",0,null,"P",0,"015",null,null,null,0,0,"","",null,false,null,0,null,null,null,0,0,0,0,1,0,0,false,0,0,0,null,0,5,null,null,0,0,0,1,0,0,false,0,0,0,null,null,null,0,0,0]
[null,null,null,"P",0,null,"P",0,"016",null,null,null,0,0,{"$f":"IF(K27<>0,AH27,\"\")","v":""},{"$f":"IF(K27<>0,AW27,\"\")","v":""},null,false,null,0,null,null,null,0,0,{"$f":"X27/$Z$4","v":0},{"$f":"(T27-$T$8)*2/$Z$4","v":0},{"$f":"SIN(Y27)*SIN(Z27)+COS(Y27)*COS(Z27)*COS(AA27)","v":1},0,0,{"$f":"IF(Y27<>Z27,90*(1+ABS(Y27-Z27)/(Y27-Z27)))","v":false},{"$f":"IF(AA27<>0,90+$Z$4*ATAN((SIN(Y27)*AB27-SIN(Z27))/(SIN(AA27)*COS(Y27)^2)),AE27*1)","v":0},{"$f":"IF(SIN(AA27)<0,AF27+180,AF27*1)","v":0},0,null,{"$f":"6365.11*AD27","v":0},5,null,null,{"$f":"X27/$Z$4","v":0},0,{"$f":"($T$8-T27)*2/$Z$4","v":0},{"$f":"SIN(AN27)*SIN(AO27)+COS(AN27)*COS(AO27)*COS(AP27)","v":1},0,{"$f":"IF(AC27<0,180/$Z$4+AC27,AC27)","v":0},{"$f":"IF(AN27<>AO27,90*(1+ABS(AN27-AO27)/(AN27-AO27)))","v":false},{"$f":"IF(AP27<>0,90+$Z$4*ATAN((SIN(AN27)*AQ27-SIN(AO27))/(SIN(AP27)*COS(AN27)^2)),AT27*1)","v":0},{"$f":"IF(SIN(AP27)<0,AU27+180,AU27*1)","v":0},0,null,null,null,{"$f":"M27","v":0},{"$f":"C27","v":0},{"$f":"K27","v":0}]
[null,null,null,"P",0,null,"P",0,"017",null,null,null,0,0,{"$f":"IF(K28<>0,AH28,\"\")","v":""},{"$f":"IF(K28<>0,AW28,\"\")","v":""},null,false,null,0,null,null,null,0,0,{"$f":"X28/$Z$4","v":0},{"$f":"(T28-$T$8)*2/$Z$4","v":0},{"$f":"SIN(Y28)*SIN(Z28)+COS(Y28)*COS(Z28)*COS(AA28)","v":1},0,0,{"$f":"IF(Y28<>Z28,90*(1+ABS(Y28-Z28)/(Y28-Z28)))","v":false},{"$f":"IF(AA28<>0,90+$Z$4*ATAN((SIN(Y28)*AB28-SIN(Z28))/(SIN(AA28)*COS(Y28)^2)),AE28*1)","v":0},{"$f":"IF(SIN(AA28)<0,AF28+180,AF28*1)","v":0},0,null,{"$f":"6365.11*AD28","v":0},5,null,null,{"$f":"X28/$Z$4","v":0},0,{"$f":"($T$8-T28)*2/$Z$4","v":0},{"$f":"SIN(AN28)*SIN(AO28)+COS(AN28)*COS(AO28)*COS(AP28)","v":1},0,{"$f":"IF(AC28<0,180/$Z$4+AC28,AC28)","v":0},{"$f":"IF(AN28<>AO28,90*(1+ABS(AN28-AO28)/(AN28-AO28)))","v":false},{"$f":"IF(AP28<>0,90+$Z$4*ATAN((SIN(AN28)*AQ28-SIN(AO28))/(SIN(AP28)*COS(AN28)^2)),AT28*1)","v":0},{"$f":"IF(SIN(AP28)<0,AU28+180,AU28*1)","v":0},0,null,null,null,{"$f":"M28","v":0},{"$f":"C28","v":0},{"$f":"K28","v":0}]
[null,null,null,"P",0,null,"P",0,"018",null,null,null,0,0,"","",null,false,null,0,null,null,null,0,0,0,0,1,0,0,false,0,0,0,null,0,5,null,null,0,0,0,1,0,0,false,0,0,0,null,null,null,0,0,0]
[null,null,null,"P",0,null,"P",0,"019",null,null,null,0,0,{"$f":"IF(K30<>0,AH30,\"\")","v":""},{"$f":"IF(K30<>0,AW30,\"\")","v":""},null,false,null,0,null,null,null,0,0,{"$f":"X30/$Z$4","v":0},{"$f":"(T30-$T$8)*2/$Z$4","v":0},{"$f":"SIN(Y30)*SIN(Z30)+COS(Y30)*COS(Z30)*COS(AA30)","v":1},0,0,{"$f":"IF(Y30<>Z30,90*(1+ABS(Y30-Z30)/(Y30-Z30)))","v":false},{"$f":"IF(AA30<>0,90+$Z$4*ATAN((SIN(Y30)*AB30-SIN(Z30))/(SIN(AA30)*COS(Y30)^2)),AE30*1)","v":0},{"$f":"IF(SIN(AA30)<0,AF30+180,AF30*1)","v":0},0,null,{"$f":"6365.11*AD30","v":0},5,null,null,{"$f":"X30/$Z$4","v":0},0,{"$f":"($T$8-T30)*2/$Z$4","v":0},{"$f":"SIN(AN30)*SIN(AO30)+COS(AN30)*COS(AO30)*COS(AP30)","v":1},0,{"$f":"IF(AC30<0,180/$Z$4+AC30,AC30)","v":0},{"$f":"IF(AN30<>AO30,90*(1+ABS(AN30-AO30)/(AN30-AO30)))","v":false},{"$f":"IF(AP30<>0,90+$Z$4*ATAN((SIN(AN30)*AQ30-SIN(AO30))/(SIN(AP30)*COS(AN30)^2)),AT30*1)","v":0},{"$f":"IF(SIN(AP30)<0,AU30+180,AU30*1)","v":0},0,null,null,null,{"$f":"M30","v":0},{"$f":"C30","v":0},{"$f":"K30","v":0}]
[null,null,null,"P",0,null,"P",0,"020",null,null,null,0,0,{"$f":"IF(K31<>0,AH31,\"\")","v":""},{"$f":"IF(K31<>0,AW31,\"\")","v":""},null,false,null,0,null,null,null,0,0,{"$f":"X31/$Z$4","v":0},{"$f":"(T31-$T$8)*2/$Z$4","v":0},{"$f":"SIN(Y31)*SIN(Z31)+COS(Y31)*COS(Z31)*COS(AA31)","v":1},0,0,{"$f":"IF(Y31<>Z31,90*(1+ABS(Y31-Z31)/(Y31-Z31)))","v":false},{"$f":"IF(AA31<>0,90+$Z$4*ATAN((SIN(Y31)*AB31-SIN(Z31))/(SIN(AA31)*COS(Y31)^2)),AE31*1)","v":0},{"$f":"IF(SIN(AA31)<0,AF31+180,AF31*1)","v":0},0,null,{"$f":"6365.11*AD31","v":0},5,null,null,{"$f":"X31/$Z$4","v":0},0,{"$f":"($T$8-T31)*2/$Z$4","v":0},{"$f":"SIN(AN31)*SIN(AO31)+COS(AN31)*COS(AO31)*COS(AP31)","v":1},0,{"$f":"IF(AC31<0,180/$Z$4+AC31,AC31)","v":0},{"$f":"IF(AN31<>AO31,90*(1+ABS(AN31-AO31)/(AN31-AO31)))","v":false},{"$f":"IF(AP31<>0,90+$Z$4*ATAN((SIN(AN31)*AQ31-SIN(AO31))/(SIN(AP31)*COS(AN31)^2)),AT31*1)","v":0},{"$f":"IF(SIN(AP31)<0,AU31+180,AU31*1)","v":0},0,null,null,null,{"$f":"M31","v":0},{"$f":"C31","v":0},{"$f":"K31","v":0}]
[null,null,null,"P",0,null,"P",0,"021",null,null,null,0,0,"","",null,false,null,0,null,null,null,0,0,0,0,1,0,0,false,0,0,0,null,0,5,null,null,0,0,0,1,0,0,false,0,0,0,null,null,null,0,0,0]
[null,null,null,"P",0,null,"P",0,"022",null,null,null,0,0,"","",null,false,null,0,null,null,null,0,0,0,0,1,0,0,false,0,0,0,null,0,5,null,null,0,0,0,1,0,0,false,0,0,0,null,null,null,0,0,0]
[null,null,null,"P",0,null,"P",0,"023",null,null,null,0,0,"","",null,false,null,0,null,null,null,0,0,0,0,1,0,0,false,0,0,0,null,0,5,null,null,0,0,0,1,0,0,false,0,0,0,null,null,null,0,0,0]
[null,null,null,"P",0,null,"P",0,"024",null,null,null,0,0,"","",null,false,null,0,null,null,null,0,0,0,0,1,0,0,false,0,0,0,null,0,5,null,null,0,0,0,1,0,0,false,0,0,0,null,null,null,0,0,0]
[null,null,null,"P",0,null,"P",0,"025",null,null,null,0,0,"","",null,false,null,0,null,null,null,0,0,0,0,1,0,0,false,0,0,0,null,0,5,null,null,0,0,0,1,0,0,false,0,0,0,null,null,null,0,0,0]
[null,null,null,"P",0,null,"P",0,"026",null,null,null,0,0,"","",null,false,null,0,null,null,null,0,0,0,0,1,0,0,false,0,0,0,null,0,5,null,null,0,0,0,1,0,0,false,0,0,0,null,null,null,0,0,0]
[null,null,null,"P",0,null,"P",0,"027",null,null,null,0,0,"","",null,false,null,0,null,null,null,0,0,0,0,1,0,0,false,0,0,0,null,0,5,null,null,0,0,0,1,0,0,false,0,0,0,null,null,null,0,0,0]
[null,null,null,"P",0,null,"P",0,"028",null,null,null,0,0,"","",null,false,null,0,null,null,null,0,0,0,0,1,0,0,false,0,0,0,null,0,5,null,null,0,0,0,1,0,0,false,0,0,0,null,null,null,0,0,0]
[null,null,null,"P",0,null,"P",0,"029",null,null,null,0,0,"","",null,false,null,0,null,null,null,0,0,0,0,1,0,0,false,0,0,0,null,0,5,null,null,0,0,0,1,0,0,false,0,0,0,null,null,null,0,0,0]
[null,null,null,"P",0,null,"P",0,"030",null,null,null,0,0,{"$f":"IF(K41<>0,AH41,\"\")","v":""},{"$f":"IF(K41<>0,AW41,\"\")","v":""},null,false,null,0,null,null,null,0,0,{"$f":"X41/$Z$4","v":0},{"$f":"(T41-$T$8)*2/$Z$4","v":0},{"$f":"SIN(Y41)*SIN(Z41)+COS(Y41)*COS(Z41)*COS(AA41)","v":1},0,0,{"$f":"IF(Y41<>Z41,90*(1+ABS(Y41-Z41)/(Y41-Z41)))","v":false},{"$f":"IF(AA41<>0,90+$Z$4*ATAN((SIN(Y41)*AB41-SIN(Z41))/(SIN(AA41)*COS(Y41)^2)),AE41*1)","v":0},{"$f":"IF(SIN(AA41)<0,AF41+180,AF41*1)","v":0},0,null,{"$f":"6365.11*AD41","v":0},5,null,null,{"$f":"X41/$Z$4","v":0},0,{"$f":"($T$8-T41)*2/$Z$4","v":0},{"$f":"SIN(AN41)*SIN(AO41)+COS(AN41)*COS(AO41)*COS(AP41)","v":1},0,{"$f":"IF(AC41<0,180/$Z$4+AC41,AC41)","v":0},{"$f":"IF(AN41<>AO41,90*(1+ABS(AN41-AO41)/(AN41-AO41)))","v":false},{"$f":"IF(AP41<>0,90+$Z$4*ATAN((SIN(AN41)*AQ41-SIN(AO41))/(SIN(AP41)*COS(AN41)^2)),AT41*1)","v":0},{"$f":"IF(SIN(AP41)<0,AU41+180,AU41*1)","v":0},0,null,null,null,{"$f":"M41","v":0},{"$f":"C41","v":0},{"$f":"K41","v":0}]
[null,null,null,"P",0,null,"P",0,"031",null,null,null,0,0,{"$f":"IF(K42<>0,AH42,\"\")","v":""},{"$f":"IF(K42<>0,AW42,\"\")","v":""},null,false,null,0,null,null,null,0,0,{"$f":"X42/$Z$4","v":0},{"$f":"(T42-$T$8)*2/$Z$4","v":0},{"$f":"SIN(Y42)*SIN(Z42)+COS(Y42)*COS(Z42)*COS(AA42)","v":1},0,0,{"$f":"IF(Y42<>Z42,90*(1+ABS(Y42-Z42)/(Y42-Z42)))","v":false},{"$f":"IF(AA42<>0,90+$Z$4*ATAN((SIN(Y42)*AB42-SIN(Z42))/(SIN(AA42)*COS(Y42)^2)),AE42*1)","v":0},{"$f":"IF(SIN(AA42)<0,AF42+180,AF42*1)","v":0},0,null,{"$f":"6365.11*AD42","v":0},5,null,null,{"$f":"X42/$Z$4","v":0},0,{"$f":"($T$8-T42)*2/$Z$4","v":0},{"$f":"SIN(AN42)*SIN(AO42)+COS(AN42)*COS(AO42)*COS(AP42)","v":1},0,{"$f":"IF(AC42<0,180/$Z$4+AC42,AC42)","v":0},{"$f":"IF(AN42<>AO42,90*(1+ABS(AN42-AO42)/(AN42-AO42)))","v":false},{"$f":"IF(AP42<>0,90+$Z$4*ATAN((SIN(AN42)*AQ42-SIN(AO42))/(SIN(AP42)*COS(AN42)^2)),AT42*1)","v":0},{"$f":"IF(SIN(AP42)<0,AU42+180,AU42*1)","v":0},0,null,null,null,{"$f":"M42","v":0},{"$f":"C42","v":0},{"$f":"K42","v":0}]
[null,null,null,"P",0,null,"P",0,"032",null,null,null,0,0,"","",null,false,null,0,null,null,null,0,0,0,0,1,0,0,false,0,0,0,null,0,5,null,null,0,0,0,1,0,0,false,0,0,0,null,null,null,0,0,0]
[null,null,null,"P",0,null,"P",0,"033",null,null,null,0,0,"","",null,false,null,0,null,null,null,0,0,0,0,1,0,0,false,0,0,0,null,0,5,null,null,0,0,0,1,0,0,false,0,0,0,null,null,null,0,0,0]
[null,null,null,"P",0,null,"P",0,"034",null,null,null,0,0,"","",null,false,null,0,null,null,null,0,0,0,0,1,0,0,false,0,0,0,null,0,5,null,null,0,0,0,1,0,0,false,0,0,0,null,null,null,0,0,0]
[null,null,null,"P",0,null,"P",0,"035",null,null,null,0,0,"","",null,false,null,0,null,null,null,0,0,0,0,1,0,0,false,0,0,0,null,0,5,null,null,0,0,0,1,0,0,false,0,0,0,null,null,null,0,0,0]
[null,null,null,"P",0,null,"P",0,"036",null,null,null,0,0,"","",null,false,null,0,null,null,null,0,0,0,0,1,0,0,false,0,0,0,null,0,5,null,null,0,0,0,1,0,0,false,0,0,0,null,null,null,0,0,0]
[null,null,null,"P",0,null,"P",0,"037",null,null,null,0,0,"","",null,false,null,0,null,null,null,0,0,0,0,1,0,0,false,0,0,0,null,0,5,null,null,0,0,0,1,0,0,false,0,0,0,null,null,null,0,0,0]
[null,null,null,"P",0,null,"P",0,"038",null,null,null,0,0,"","",null,false,null,0,null,null,null,0,0,0,0,1,0,0,false,0,0,0,null,0,5,null,null,0,0,0,1,0,0,false,0,0,0,null,null,null,0,0,0]
[null,null,null,"P",0,null,"P",0,"039",null,null,null,0,0,"","",null,false,null,0,null,null,null,0,0,0,0,1,0,0,false,0,0,0,null,0,5,null,null,0,0,0,1,0,0,false,0,0,0,null,null,null,0,0,0]
[null,null,null,"P",0,null,"P",0,"040",null,null,null,0,0,"","",null,false,null,0,null,null,null,0,0,0,0,1,0,0,false,0,0,0,null,0,5,null,null,0,0,0,1,0,0,false,0,0,0,null,null,null,0,0,0]
[null,null,null,"P",0,null,"P",0,"041",null,null,null,0,0,"","",null,false,null,0,null,null,null,0,0,0,0,1,0,0,false,0,0,0,null,0,5,null,null,0,0,0,1,0,0,false,0,0,0,null,null,null,0,0,0]
[null,null,null,"P",0,null,"P",0,"042",null,null,null,0,0,"","",null,false,null,0,null,null,null,0,0,0,0,1,0,0,false,0,0,0,null,0,5,null,null,0,0,0,1,0,0,false,0,0,0,null,null,null,0,0,0]
[null,null,null,"P",0,null,"P",0,"043",null,null,null,0,0,"","",null,false,null,0,null,null,null,0,0,0,0,1,0,0,false,0,0,0,null,0,5,null,null,0,0,0,1,0,0,false,0,0,0,null,null,null,0,0,0]
[null,null,null,"P",0,null,"P",0,"044",null,null,null,0,0,"","",null,false,null,0,null,null,null,0,0,0,0,1,0,0,false,0,0,0,null,0,5,null,null,0,0,0,1,0,0,false,0,0,0,null,null,null,0,0,0]
[null,null,null,"P",0,null,"P",0,"045",null,null,null,0,0,"","",null,false,null,0,null,null,null,0,0,0,0,1,0,0,false,0,0,0,null,0,5,null,null,0,0,0,1,0,0,false,0,0,0,null,null,null,0,0,0]
[null,null,null,"P",0,null,"P",0,"046",null,null,null,0,0,"","",null,false,null,0,null,null,null,0,0,0,0,1,0,0,false,0,0,0,null,0,5,null,null,0,0,0,1,0,0,false,0,0,0,null,null,null,0,0,0]
[null,null,null,"P",0,null,"P",0,"047",null,null,null,0,0,"","",null,false,null,0,null,null,null,0,0,0,0,1,0,0,false,0,0,0,null,0,5,null,null,0,0,0,1,0,0,false,0,0,0,null,null,null,0,0,0]
[null,null,null,"P",0,null,"P",0,"048",null,null,null,0,0,"","",null,false,null,0,null,null,null,0,0,0,0,1,0,0,false,0,0,0,null,0,5,null,null,0,0,0,1,0,0,false,0,0,0,null,null,null,0,0,0]
[null,null,null,"P",0,null,"P",0,"049",null,null,null,0,0,"","",null,false,null,0,null,null,null,0,0,0,0,1,0,0,false,0,0,0,null,0,5,null,null,0,0,0,1,0,0,false,0,0,0,null,null,null,0,0,0]
[null,null,null,"P",0,null,"P",0,"050",null,null,null,0,0,"","",null,false,null,0,null,null,null,0,0,0,0,1,0,0,false,0,0,0,null,0,5,null,null,0,0,0,1,0,0,false,0,0,0,null,null,null,0,0,0]
[null,null,null,null,null,null,null,null,null,null,null,null,null,null,null,null,null,null,null,null,null,null,null,null,null,null,null,null,null,null,null,null,null,null,null,null,null,null,null,null,null,null,null,null,null,null,null,null,null,null,null,null,null,null,null,0]

{"sheet":"4m","index":3,"n_rows":62,"n_cols":57,"rows_kept":62,"cut":false,"hidden":true,"merged":[[10,3,10,5],[10,6,10,8],[0,0,0,15],[3,6,3,8],[5,2,5,7],[7,2,7,3],[7,9,7,10]]}
["ATV CONTEST LOG  4 m (UK only)"]
[]
[]
[null,null,null,null,null,null,null,null,null,null,null,"Band:",4," m",null,null,null,null,null,null,null,null,null,null,"Deg/Rad :",{"$f":"180/PI()","v":57.295779513082323}]
[]
["Date:",null,{"$f":"IF(Summary!B3=\"\",\"\",Summary!B3)","v":"2022-07-10"},null,null,null,null,null,null,null,null,"Multiplier:",2,null,"Total:",{"$f":"SUM(N12:N61)","v":0},{"$f":"IF(M4=70,1,IF(M4=24,2,IF(M4=23,2,IF(M4=13,5))))","v":false},{"$f":"IF(M4=9,\"5\",IF(M4=6,\"5\",IF(M4=3,\"5\",IF(M4=1.3,\"5\"))))","v":false},{"$f":"IF(M4=1.2,\"5\",IF(M4=0.6,\"5\",IF(M4=0.7,\"5\")))","v":false},"Longitude",null,null,null,"Latitude"]
[]
["Code: ",null,{"$f":"Summary!B19","v":"Codice a 4 cifre scelto"},null,null,null,null,null,"Call:",{"$f":"Summary!B5","v":0},null,"Locator :",{"$f":"Summary!B15","v":0},null,null,null,null,null,null,0,null,null,null,0]
[]
["Date","Time","Stations","Rprt.+ Seq.",null,null,"Rprt.+ Seq.",null,null,"Code"," Locator","Comments","Distance","Points","Heading","Heading",null,null,null,null,null,null,null,null,"Local Lat","Dist Lat","Diff Long",null,"Path Rad",null,null,null,null,null,null,null,null,null,null,"Dist Lat","Local Lat","Diff Long",null,"Path Rad",null,null,null,null,"Back"]
[null,"UTC","worked","received",null,null,"sent",null,null,"received",null,null,"km",null,"(own)","(other)",null,null,null,"Longitude",null,null,null,"Latitude","A","B","L","E","D","Dcond","F1cond","F2cond","F3cond","Bearing",null,"R","Rint   km",null,null,"A","B","L","E","D","Dcond","F1cond","F2cond","F3cond","Bearing",null,null,null,"dx","call","locator","nr. QSO's","total km's"]
[null,null,null,"P",0,null,"P",0,"001",null,null,null,{"$f":"IF(K12<>\"\",AK12,0)","v":0},{"$f":"(IF(E12>1,M12,0)*$M$6/2)+(IF(H12>1,M12,0)*$M$6/2)","v":0},{"$f":"IF(K12<>0,AH12,\"\")","v":""},{"$f":"IF(K12<>0,AW12,\"\")","v":""},null,null,null,0,null,null,null,0,{"$f":"$X$8/$Z$4","v":0},{"$f":"X12/$Z$4","v":0},{"$f":"(T12-$T$8)*2/$Z$4","v":0},{"$f":"SIN(Y12)*SIN(Z12)+COS(Y12)*COS(Z12)*COS(AA12)","v":1},{"$f":"ATAN(SQRT(1-AB12*AB12)/AB12)","v":0},{"$f":"IF(AC12<0,180/$Z$4+AC12,AC12)","v":0},{"$f":"IF(Y12<>Z12,90*(1+ABS(Y12-Z12)/(Y12-Z12)))","v":false},{"$f":"IF(AA12<>0,90+$Z$4*ATAN((SIN(Y12)*AB12-SIN(Z12))/(SIN(AA12)*COS(Y12)^2)),AE12*1)","v":0},{"$f":"IF(SIN(AA12)<0,AF12+180,AF12*1)","v":0},{"$f":"INT(AG12)","v":0},null,{"$f":"6365.11*AD12","v":0},{"$f":"IF(AJ12<5,5,INT(AJ12+0.5))","v":5},null,null,{"$f":"X12/$Z$4","v":0},{"$f":"$X$8/$Z$4","v":0},{"$f":"($T$8-T12)*2/$Z$4","v":0},{"$f":"SIN(AN12)*SIN(AO12)+COS(AN12)*COS(AO12)*COS(AP12)","v":1},{"$f":"ATAN(SQRT(1-AQ12*AQ12)/AQ12)","v":0},{"$f":"IF(AC12<0,180/$Z$4+AC12,AC12)","v":0},{"$f":"IF(AN12<>AO12,90*(1+ABS(AN12-AO12)/(AN12-AO12)))","v":false},{"$f":"IF(AP12<>0,90+$Z$4*ATAN((SIN(AN12)*AQ12-SIN(AO12))/(SIN(AP12)*COS(AN12)^2)),AT12*1)","v":0},{"$f":"IF(SIN(AP12)<0,AU12+180,AU12*1)","v":0},{"$f":"INT(AV12)","v":0},null,null,null,{"$f":"M12","v":0},{"$f":"C12","v":0},{"$f":"K12","v":0},0,0]
[null,null,null,"P",0,null,"P",0,"002",null,null,null,{"$f":"IF(K13<>\"\",AK13,0)","v":0},{"$f":"(IF(E13>1,M13,0)*$M$6/2)+(IF(H13>1,M13,0)*$M$6/2)","v":0},{"$f":"IF(K13<>0,AH13,\"\")","v":""},{"$f":"IF(K13<>0,AW13,\"\")","v":""},null,null,null,0,null,null,null,0,{"$f":"$X$8/$Z$4","v":0},{"$f":"X13/$Z$4","v":0},{"$f":"(T13-$T$8)*2/$Z$4","v":0},{"$f":"SIN(Y13)*SIN(Z13)+COS(Y13)*COS(Z13)*COS(AA13)","v":1},{"$f":"ATAN(SQRT(1-AB13*AB13)/AB13)","v":0},{"$f":"IF(AC13<0,180/$Z$4+AC13,AC13)","v":0},false,{"$f":"IF(AA13<>0,90+$Z$4*ATAN((SIN(Y13)*AB13-SIN(Z13))/(SIN(AA13)*COS(Y13)^2)),AE13*1)","v":0},{"$f":"IF(SIN(AA13)<0,AF13+180,AF13*1)","v":0},{"$f":"INT(AG13)","v":0},null,{"$f":"6365.11*AD13","v":0},5,null,null,0,0,0,1,0,0,false,0,0,0,null,null,null,{"$f":"M13","v":0},{"$f":"C13","v":0},{"$f":"K13","v":0}]
[null,null,null,"P",0,null,"P",0,"003",null,null,null,0,0,{"$f":"IF(K14<>0,AH14,\"\")","v":""},{"$f":"IF(K14<>0,AW14,\"\")","v":""},null,null,null,0,null,null,null,0,0,0,0,1,0,0,false,0,0,0,null,{"$f":"6365.11*AD14","v":0},5,null,null,0,0,0,1,0,0,false,0,0,0,null,null,null,0,0,0]
[null,null,null,"P",0,null,"P",0,"004",null,null,null,0,0,"","",null,null,null,0,null,null,null,0,0,0,0,1,0,0,false,0,0,0,null,0,5,null,null,0,0,0,1,0,0,false,0,0,0,null,null,null,0,0,0]
[null,null,null,"P",0,null,"P",0,"005",null,null,null,0,0,"","",null,null,null,0,null,null,null,0,0,0,0,1,0,0,false,0,0,0,null,0,5,null,null,0,0,0,1,0,0,false,0,0,0,null,null,null,0,0,0]
[null,null,null,"P",0,null,"P",0,"006",null,null,null,0,0,"","",null,null,null,0,null,null,null,0,0,0,0,1,0,0,false,0,0,0,null,0,5,null,null,0,0,0,1,0,0,false,0,0,0,null,null,null,0,0,0]
[null,null,null,"P",0,null,"P",0,"007",null,null,null,0,0,"","",null,null,null,0,null,null,null,0,0,0,0,1,0,0,false,0,0,0,null,0,5,null,null,0,0,0,1,0,0,false,0,0,0,null,null,null,0,0,0]
[null,null,null,"P",0,null,"P",0,"008",null,null,null,0,0,"","",null,null,null,0,null,null,null,0,0,0,0,1,0,0,false,0,0,0,null,0,5,null,null,0,0,0,1,0,0,false,0,0,0,null,null,null,0,0,0]
[null,null,null,"P",0,null,"P",0,"009",null,null,null,0,0,"","",null,null,null,0,null,null,null,0,0,0,0,1,0,0,false,0,0,0,null,0,5,null,null,0,0,0,1,0,0,false,0,0,0,null,null,null,0,0,0]
[null,null,null,"P",0,null,"P",0,"010",null,null,null,0,0,"","",null,null,null,0,null,null,null,0,0,0,0,1,0,0,false,0,0,0,null,0,5,null,null,0,0,0,1,0,0,false,0,0,0,null,null,null,0,0,0]
[null,null,null,"P",0,null,"P",0,"011",null,null,null,0,0,"","",null,null,null,0,null,null,null,0,0,0,0,1,0,0,false,0,0,0,null,0,5,null,null,0,0,0,1,0,0,false,0,0,0,null,null,null,0,0,0]
[null,null,null,"P",0,null,"P",0,"012",null,null,null,0,0,"","",null,null,null,0,null,null,null,0,0,0,0,1,0,0,false,0,0,0,null,0,5,null,null,0,0,0,1,0,0,false,0,0,0,null,null,null,0,0,0]
[null,null,null,"P",0,null,"P",0,"013",null,null,null,0,0,"","",null,null,null,0,null,null,null,0,0,0,0,1,0,0,false,0,0,0,null,0,5,null,null,0,0,0,1,0,0,false,0,0,0,null,null,null,0,0,0]
[null,null,null,"P",0,null,"P",0,"014",null,null,null,0,0,"","",null,null,null,0,null,null,null,0,0,0,0,1,0,0,false,0,0,0,null,0,5,null,null,0,0,0,1,0,0,false,0,0,0,null,null,null,0,0,0]
[null,null,null,"P",0,null,"P",0,"015",null,null,null,0,0,"","",null,null,null,0,null,null,null,0,0,0,0,1,0,0,false,0,0,0,null,0,5,null,null,0,0,0,1,0,0,false,0,0,0,null,null,null,0,0,0]
[null,null,null,"P",0,null,"P",0,"016",null,null,null,0,0,{"$f":"IF(K27<>0,AH27,\"\")","v":""},{"$f":"IF(K27<>0,AW27,\"\")","v":""},null,null,null,0,null,null,null,0,0,{"$f":"X27/$Z$4","v":0},{"$f":"(T27-$T$8)*2/$Z$4","v":0},{"$f":"SIN(Y27)*SIN(Z27)+COS(Y27)*COS(Z27)*COS(AA27)","v":1},0,0,{"$f":"IF(Y27<>Z27,90*(1+ABS(Y27-Z27)/(Y27-Z27)))","v":false},{"$f":"IF(AA27<>0,90+$Z$4*ATAN((SIN(Y27)*AB27-SIN(Z27))/(SIN(AA27)*COS(Y27)^2)),AE27*1)","v":0},{"$f":"IF(SIN(AA27)<0,AF27+180,AF27*1)","v":0},0,null,{"$f":"6365.11*AD27","v":0},5,null,null,{"$f":"X27/$Z$4","v":0},0,{"$f":"($T$8-T27)*2/$Z$4","v":0},{"$f":"SIN(AN27)*SIN(AO27)+COS(AN27)*COS(AO27)*COS(AP27)","v":1},0,{"$f":"IF(AC27<0,180/$Z$4+AC27,AC27)","v":0},{"$f":"IF(AN27<>AO27,90*(1+ABS(AN27-AO27)/(AN27-AO27)))","v":false},{"$f":"IF(AP27<>0,90+$Z$4*ATAN((SIN(AN27)*AQ27-SIN(AO27))/(SIN(AP27)*COS(AN27)^2)),AT27*1)","v":0},{"$f":"IF(SIN(AP27)<0,AU27+180,AU27*1)","v":0},0,null,null,null,{"$f":"M27","v":0},{"$f":"C27","v":0},{"$f":"K27","v":0}]
[null,null,null,"P",0,null,"P",0,"017",null,null,null,0,0,{"$f":"IF(K28<>0,AH28,\"\")","v":""},{"$f":"IF(K28<>0,AW28,\"\")","v":""},null,null,null,0,null,null,null,0,0,{"$f":"X28/$Z$4","v":0},{"$f":"(T28-$T$8)*2/$Z$4","v":0},{"$f":"SIN(Y28)*SIN(Z28)+COS(Y28)*COS(Z28)*COS(AA28)","v":1},0,0,{"$f":"IF(Y28<>Z28,90*(1+ABS(Y28-Z28)/(Y28-Z28)))","v":false},{"$f":"IF(AA28<>0,90+$Z$4*ATAN((SIN(Y28)*AB28-SIN(Z28))/(SIN(AA28)*COS(Y28)^2)),AE28*1)","v":0},{"$f":"IF(SIN(AA28)<0,AF28+180,AF28*1)","v":0},0,null,{"$f":"6365.11*AD28","v":0},5,null,null,{"$f":"X28/$Z$4","v":0},0,{"$f":"($T$8-T28)*2/$Z$4","v":0},{"$f":"SIN(AN28)*SIN(AO28)+COS(AN28)*COS(AO28)*COS(AP28)","v":1},0,{"$f":"IF(AC28<0,180/$Z$4+AC28,AC28)","v":0},{"$f":"IF(AN28<>AO28,90*(1+ABS(AN28-AO28)/(AN28-AO28)))","v":false},{"$f":"IF(AP28<>0,90+$Z$4*ATAN((SIN(AN28)*AQ28-SIN(AO28))/(SIN(AP28)*COS(AN28)^2)),AT28*1)","v":0},{"$f":"IF(SIN(AP28)<0,AU28+180,AU28*1)","v":0},0,null,null,null,{"$f":"M28","v":0},{"$f":"C28","v":0},{"$f":"K28","v":0}]
[null,null,null,"P",0,null,"P",0,"018",null,null,null,0,0,"","",null,null,null,0,null,null,null,0,0,0,0,1,0,0,false,0,0,0,null,0,5,null,null,0,0,0,1,0,0,false,0,0,0,null,null,null,0,0,0]
[null,null,null,"P",0,null,"P",0,"019",null,null,null,0,0,{"$f":"IF(K30<>0,AH30,\"\")","v":""},{"$f":"IF(K30<>0,AW30,\"\")","v":""},null,null,null,0,null,null,null,0,0,{"$f":"X30/$Z$4","v":0},{"$f":"(T30-$T$8)*2/$Z$4","v":0},{"$f":"SIN(Y30)*SIN(Z30)+COS(Y30)*COS(Z30)*COS(AA30)","v":1},0,0,{"$f":"IF(Y30<>Z30,90*(1+ABS(Y30-Z30)/(Y30-Z30)))","v":false},{"$f":"IF(AA30<>0,90+$Z$4*ATAN((SIN(Y30)*AB30-SIN(Z30))/(SIN(AA30)*COS(Y30)^2)),AE30*1)","v":0},{"$f":"IF(SIN(AA30)<0,AF30+180,AF30*1)","v":0},0,null,{"$f":"6365.11*AD30","v":0},5,null,null,{"$f":"X30/$Z$4","v":0},0,{"$f":"($T$8-T30)*2/$Z$4","v":0},{"$f":"SIN(AN30)*SIN(AO30)+COS(AN30)*COS(AO30)*COS(AP30)","v":1},0,{"$f":"IF(AC30<0,180/$Z$4+AC30,AC30)","v":0},{"$f":"IF(AN30<>AO30,90*(1+ABS(AN30-AO30)/(AN30-AO30)))","v":false},{"$f":"IF(AP30<>0,90+$Z$4*ATAN((SIN(AN30)*AQ30-SIN(AO30))/(SIN(AP30)*COS(AN30)^2)),AT30*1)","v":0},{"$f":"IF(SIN(AP30)<0,AU30+180,AU30*1)","v":0},0,null,null,null,{"$f":"M30","v":0},{"$f":"C30","v":0},{"$f":"K30","v":0}]
[null,null,null,"P",0,null,"P",0,"020",null,null,null,0,0,{"$f":"IF(K31<>0,AH31,\"\")","v":""},{"$f":"IF(K31<>0,AW31,\"\")","v":""},null,null,null,0,null,null,null,0,0,{"$f":"X31/$Z$4","v":0},{"$f":"(T31-$T$8)*2/$Z$4","v":0},{"$f":"SIN(Y31)*SIN(Z31)+COS(Y31)*COS(Z31)*COS(AA31)","v":1},0,0,{"$f":"IF(Y31<>Z31,90*(1+ABS(Y31-Z31)/(Y31-Z31)))","v":false},{"$f":"IF(AA31<>0,90+$Z$4*ATAN((SIN(Y31)*AB31-SIN(Z31))/(SIN(AA31)*COS(Y31)^2)),AE31*1)","v":0},{"$f":"IF(SIN(AA31)<0,AF31+180,AF31*1)","v":0},0,null,{"$f":"6365.11*AD31","v":0},5,null,null,{"$f":"X31/$Z$4","v":0},0,{"$f":"($T$8-T31)*2/$Z$4","v":0},{"$f":"SIN(AN31)*SIN(AO31)+COS(AN31)*COS(AO31)*COS(AP31)","v":1},0,{"$f":"IF(AC31<0,180/$Z$4+AC31,AC31)","v":0},{"$f":"IF(AN31<>AO31,90*(1+ABS(AN31-AO31)/(AN31-AO31)))","v":false},{"$f":"IF(AP31<>0,90+$Z$4*ATAN((SIN(AN31)*AQ31-SIN(AO31))/(SIN(AP31)*COS(AN31)^2)),AT31*1)","v":0},{"$f":"IF(SIN(AP31)<0,AU31+180,AU31*1)","v":0},0,null,null,null,{"$f":"M31","v":0},{"$f":"C31","v":0},{"$f":"K31","v":0}]
[null,null,null,"P",0,null,"P",0,"021",null,null,null,0,0,"","",null,null,null,0,null,null,null,0,0,0,0,1,0,0,false,0,0,0,null,0,5,null,null,0,0,0,1,0,0,false,0,0,0,null,null,null,0,0,0]
[null,null,null,"P",0,null,"P",0,"022",null,null,null,0,0,"","",null,null,null,0,null,null,null,0,0,0,0,1,0,0,false,0,0,0,null,0,5,null,null,0,0,0,1,0,0,false,0,0,0,null,null,null,0,0,0]
[null,null,null,"P",0,null,"P",0,"023",null,null,null,0,0,"","",null,null,null,0,null,null,null,0,0,0,0,1,0,0,false,0,0,0,null,0,5,null,null,0,0,0,1,0,0,false,0,0,0,null,null,null,0,0,0]
[null,null,null,"P",0,null,"P",0,"024",null,null,null,0,0,"","",null,null,null,0,null,null,null,0,0,0,0,1,0,0,false,0,0,0,null,0,5,null,null,0,0,0,1,0,0,false,0,0,0,null,null,null,0,0,0]
[null,null,null,"P",0,null,"P",0,"025",null,null,null,0,0,"","",null,null,null,0,null,null,null,0,0,0,0,1,0,0,false,0,0,0,null,0,5,null,null,0,0,0,1,0,0,false,0,0,0,null,null,null,0,0,0]
[null,null,null,"P",0,null,"P",0,"026",null,null,null,0,0,"","",null,null,null,0,null,null,null,0,0,0,0,1,0,0,false,0,0,0,null,0,5,null,null,0,0,0,1,0,0,false,0,0,0,null,null,null,0,0,0]
[null,null,null,"P",0,null,"P",0,"027",null,null,null,0,0,"","",null,null,null,0,null,null,null,0,0,0,0,1,0,0,false,0,0,0,null,0,5,null,null,0,0,0,1,0,0,false,0,0,0,null,null,null,0,0,0]
[null,null,null,"P",0,null,"P",0,"028",null,null,null,0,0,"","",null,null,null,0,null,null,null,0,0,0,0,1,0,0,false,0,0,0,null,0,5,null,null,0,0,0,1,0,0,false,0,0,0,null,null,null,0,0,0]
[null,null,null,"P",0,null,"P",0,"029",null,null,null,0,0,"","",null,null,null,0,null,null,null,0,0,0,0,1,0,0,false,0,0,0,null,0,5,null,null,0,0,0,1,0,0,false,0,0,0,null,null,null,0,0,0]
[null,null,null,"P",0,null,"P",0,"030",null,null,null,0,0,{"$f":"IF(K41<>0,AH41,\"\")","v":""},{"$f":"IF(K41<>0,AW41,\"\")","v":""},null,null,null,0,null,null,null,0,0,{"$f":"X41/$Z$4","v":0},{"$f":"(T41-$T$8)*2/$Z$4","v":0},{"$f":"SIN(Y41)*SIN(Z41)+COS(Y41)*COS(Z41)*COS(AA41)","v":1},0,0,{"$f":"IF(Y41<>Z41,90*(1+ABS(Y41-Z41)/(Y41-Z41)))","v":false},{"$f":"IF(AA41<>0,90+$Z$4*ATAN((SIN(Y41)*AB41-SIN(Z41))/(SIN(AA41)*COS(Y41)^2)),AE41*1)","v":0},{"$f":"IF(SIN(AA41)<0,AF41+180,AF41*1)","v":0},0,null,{"$f":"6365.11*AD41","v":0},5,null,null,{"$f":"X41/$Z$4","v":0},0,{"$f":"($T$8-T41)*2/$Z$4","v":0},{"$f":"SIN(AN41)*SIN(AO41)+COS(AN41)*COS(AO41)*COS(AP41)","v":1},0,{"$f":"IF(AC41<0,180/$Z$4+AC41,AC41)","v":0},{"$f":"IF(AN41<>AO41,90*(1+ABS(AN41-AO41)/(AN41-AO41)))","v":false},{"$f":"IF(AP41<>0,90+$Z$4*ATAN((SIN(AN41)*AQ41-SIN(AO41))/(SIN(AP41)*COS(AN41)^2)),AT41*1)","v":0},{"$f":"IF(SIN(AP41)<0,AU41+180,AU41*1)","v":0},0,null,null,null,{"$f":"M41","v":0},{"$f":"C41","v":0},{"$f":"K41","v":0}]
[null,null,null,"P",0,null,"P",0,"031",null,null,null,0,0,{"$f":"IF(K42<>0,AH42,\"\")","v":""},{"$f":"IF(K42<>0,AW42,\"\")","v":""},null,null,null,0,null,null,null,0,0,{"$f":"X42/$Z$4","v":0},{"$f":"(T42-$T$8)*2/$Z$4","v":0},{"$f":"SIN(Y42)*SIN(Z42)+COS(Y42)*COS(Z42)*COS(AA42)","v":1},0,0,{"$f":"IF(Y42<>Z42,90*(1+ABS(Y42-Z42)/(Y42-Z42)))","v":false},{"$f":"IF(AA42<>0,90+$Z$4*ATAN((SIN(Y42)*AB42-SIN(Z42))/(SIN(AA42)*COS(Y42)^2)),AE42*1)","v":0},{"$f":"IF(SIN(AA42)<0,AF42+180,AF42*1)","v":0},0,null,{"$f":"6365.11*AD42","v":0},5,null,null,{"$f":"X42/$Z$4","v":0},0,{"$f":"($T$8-T42)*2/$Z$4","v":0},{"$f":"SIN(AN42)*SIN(AO42)+COS(AN42)*COS(AO42)*COS(AP42)","v":1},0,{"$f":"IF(AC42<0,180/$Z$4+AC42,AC42)","v":0},{"$f":"IF(AN42<>AO42,90*(1+ABS(AN42-AO42)/(AN42-AO42)))","v":false},{"$f":"IF(AP42<>0,90+$Z$4*ATAN((SIN(AN42)*AQ42-SIN(AO42))/(SIN(AP42)*COS(AN42)^2)),AT42*1)","v":0},{"$f":"IF(SIN(AP42)<0,AU42+180,AU42*1)","v":0},0,null,null,null,{"$f":"M42","v":0},{"$f":"C42","v":0},{"$f":"K42","v":0}]
[null,null,null,"P",0,null,"P",0,"032",null,null,null,0,0,"","",null,null,null,0,null,null,null,0,0,0,0,1,0,0,false,0,0,0,null,0,5,null,null,0,0,0,1,0,0,false,0,0,0,null,null,null,0,0,0]
[null,null,null,"P",0,null,"P",0,"033",null,null,null,0,0,"","",null,null,null,0,null,null,null,0,0,0,0,1,0,0,false,0,0,0,null,0,5,null,null,0,0,0,1,0,0,false,0,0,0,null,null,null,0,0,0]
[null,null,null,"P",0,null,"P",0,"034",null,null,null,0,0,"","",null,null,null,0,null,null,null,0,0,0,0,1,0,0,false,0,0,0,null,0,5,null,null,0,0,0,1,0,0,false,0,0,0,null,null,null,0,0,0]
[null,null,null,"P",0,null,"P",0,"035",null,null,null,0,0,"","",null,null,null,0,null,null,null,0,0,0,0,1,0,0,false,0,0,0,null,0,5,null,null,0,0,0,1,0,0,false,0,0,0,null,null,null,0,0,0]
[null,null,null,"P",0,null,"P",0,"036",null,null,null,0,0,"","",null,null,null,0,null,null,null,0,0,0,0,1,0,0,false,0,0,0,null,0,5,null,null,0,0,0,1,0,0,false,0,0,0,null,null,null,0,0,0]
[null,null,null,"P",0,null,"P",0,"037",null,null,null,0,0,"","",null,null,null,0,null,null,null,0,0,0,0,1,0,0,false,0,0,0,null,0,5,null,null,0,0,0,1,0,0,false,0,0,0,null,null,null,0,0,0]
[null,null,null,"P",0,null,"P",0,"038",null,null,null,0,0,"","",null,null,null,0,null,null,null,0,0,0,0,1,0,0,false,0,0,0,null,0,5,null,null,0,0,0,1,0,0,false,0,0,0,null,null,null,0,0,0]
[null,null,null,"P",0,null,"P",0,"039",null,null,null,0,0,"","",null,null,null,0,null,null,null,0,0,0,0,1,0,0,false,0,0,0,null,0,5,null,null,0,0,0,1,0,0,false,0,0,0,null,null,null,0,0,0]
[null,null,null,"P",0,null,"P",0,"040",null,null,null,0,0,"","",null,null,null,0,null,null,null,0,0,0,0,1,0,0,false,0,0,0,null,0,5,null,null,0,0,0,1,0,0,false,0,0,0,null,null,null,0,0,0]
[null,null,null,"P",0,null,"P",0,"041",null,null,null,0,0,"","",null,null,null,0,null,null,null,0,0,0,0,1,0,0,false,0,0,0,null,0,5,null,null,0,0,0,1,0,0,false,0,0,0,null,null,null,0,0,0]
[null,null,null,"P",0,null,"P",0,"042",null,null,null,0,0,"","",null,null,null,0,null,null,null,0,0,0,0,1,0,0,false,0,0,0,null,0,5,null,null,0,0,0,1,0,0,false,0,0,0,null,null,null,0,0,0]
[null,null,null,"P",0,null,"P",0,"043",null,null,null,0,0,"","",null,null,null,0,null,null,null,0,0,0,0,1,0,0,false,0,0,0,null,0,5,null,null,0,0,0,1,0,0,false,0,0,0,null,null,null,0,0,0]
[null,null,null,"P",0,null,"P",0,"044",null,null,null,0,0,"","",null,null,null,0,null,null,null,0,0,0,0,1,0,0,false,0,0,0,null,0,5,null,null,0,0,0,1,0,0,false,0,0,0,null,null,null,0,0,0]
[null,null,null,"P",0,null,"P",0,"045",null,null,null,0,0,"","",null,null,null,0,null,null,null,0,0,0,0,1,0,0,false,0,0,0,null,0,5,null,null,0,0,0,1,0,0,false,0,0,0,null,null,null,0,0,0]
[null,null,null,"P",0,null,"P",0,"046",null,null,null,0,0,"","",null,null,null,0,null,null,null,0,0,0,0,1,0,0,false,0,0,0,null,0,5,null,null,0,0,0,1,0,0,false,0,0,0,null,null,null,0,0,0]
[null,null,null,"P",0,null,"P",0,"047",null,null,null,0,0,"","",null,null,null,0,null,null,null,0,0,0,0,1,0,0,false,0,0,0,null,0,5,null,null,0,0,0,1,0,0,false,0,0,0,null,null,null,0,0,0]
[null,null,null,"P",0,null,"P",0,"048",null,null,null,0,0,"","",null,null,null,0,null,null,null,0,0,0,0,1,0,0,false,0,0,0,null,0,5,null,null,0,0,0,1,0,0,false,0,0,0,null,null,null,0,0,0]
[null,null,null,"P",0,null,"P",0,"049",null,null,null,0,0,"","",null,null,null,0,null,null,null,0,0,0,0,1,0,0,false,0,0,0,null,0,5,null,null,0,0,0,1,0,0,false,0,0,0,null,null,null,0,0,0]
[null,null,null,"P",0,null,"P",0,"050",null,null,null,0,0,"","",null,null,null,0,null,null,null,0,0,0,0,1,0,0,false,0,0,0,null,0,5,null,null,0,0,0,1,0,0,false,0,0,0,null,null,null,0,0,0]
[null,null,null,null,null,null,null,null,null,null,null,null,null,null,null,null,null,null,null,null,null,null,null,null,null,null,null,null,null,null,null,null,null,null,null,null,null,null,null,null,null,null,null,null,null,null,null,null,null,null,null,null,null,null,null,0]

{"sheet":"2m","index":4,"n_rows":62,"n_cols":57,"rows_kept":62,"cut":false,"hidden":false,"merged":[[5,2,5,7],[7,2,7,3],[7,9,7,10],[0,0,0,16],[7,7,7,8],[9,16,10,16],[9,1,10,1],[9,2,10,2],[9,3,10,5],[9,6,10,8],[9,9,10,9],[9,10,10,10],[9,11,10,11],[9,12,10,12],[9,13,10,13],[9,14,10,14],[9,15,10,15],[9,0,10,0],[3,6,3,8]]}
["ATV CONTEST LOG  2 m"]
[]
[]
[null,null,null,null,null,null,null,null,null,null,null,{"$f":"IF(Summary!$V$3=1,\"Banda:\",\"Band:\")","v":"Banda:"},2," m",{"$f":"IF(Summary!$V$3=1,\"Analogico:\",\"Analogic\")","v":"Analogico:"},{"$f":"SUMIF($R$12:$R$61,\"=FALSO\",$N$12:$N$61)","v":0},null,null,null,null,null,null,null,null,"Deg/Rad :",{"$f":"180/PI()","v":57.295779513082323}]
[]
[{"$f":"IF(Summary!$V$3=1,\"Data:\",\"Date:\")","v":"Data:"},null,{"$f":"IF(Summary!B3=\"\",\"\",Summary!B3)","v":"2022-07-10"},null,null,null,null,null,null,null,null,{"$f":"IF(Summary!$V$3=1,\"Moltiplicatore:\",\"Multiplier:\")","v":"Moltiplicatore:"},{"$f":"Summary!$AI$39","v":2},null,{"$f":"IF(Summary!$V$3=1,\"Totale:\",\"Total:\")","v":"Totale:"},{"$f":"SUM(N12:N61)","v":0},{"$f":"IF(M4=70,1,IF(M4=24,2,IF(M4=23,2,IF(M4=13,5))))","v":false},{"$f":"IF(M4=9,\"5\",IF(M4=6,\"5\",IF(M4=3,\"5\",IF(M4=1.3,\"5\"))))","v":false},{"$f":"IF(M4=1.2,\"5\",IF(M4=0.6,\"5\",IF(M4=0.7,\"5\")))","v":false},"Longitude",null,null,null,"Latitude"]
[]
[{"$f":"IF(Summary!$V$3=1,\"Codice:\",\"Code:\")","v":"Codice:"},null,{"$f":"Summary!$B$22","v":0},null,null,null,null,{"$f":"IF(Summary!$V$3=1,\"Nominativo:\",\"Call:\")","v":"Nominativo:"},null,{"$f":"Summary!B5","v":0},null,{"$f":"IF(Summary!$V$3=1,\"Locatore WW:\",\"WW Locator:\")","v":"Locatore WW:"},{"$f":"Summary!B15","v":0},null,{"$f":"IF(Summary!$V$3=1,\"Digitale:\",\"Digital:\")","v":"Digitale:"},{"$f":"SUMIF($R$12:$R$61,\"=VERO\",$N$12:$N$61)","v":0},null,null,null,0,null,null,null,0]
[]
[{"$f":"IF(Summary!$V$3=1,\"Data\",\"Date\")","v":"Data"},{"$f":"IF(Summary!$V$3=1,\"Ora UTC\",\"Time UTC\")","v":"Ora UTC"},{"$f":"IF(Summary!$V$3=1,\"Stazioni Collegate\",\"Stations Worked\")","v":"Stazioni Collegate"},{"$f":"IF(Summary!$V$3=1,\"Rprt.+ Sequenza Ricevuta\",\"Rprt.+ Sequence Received\")","v":"Rprt.+ Sequenza Ricevuta"},null,null,{"$f":"IF(Summary!$V$3=1,\"Rpt.+ Sequenza Inviata\",\"Rpt.+ Sequence Sent\")","v":"Rpt.+ Sequenza Inviata"},null,null,{"$f":"IF(Summary!$V$3=1,\"Codice Ricevuto\",\"Code Received\")","v":"Codice Ricevuto"},{"$f":"IF(Summary!$V$3=1,\"Locatore WW\",\"WW Locator\")","v":"Locatore WW"},{"$f":"IF(Summary!$V$3=1,\"Commenti\",\"Comments\")","v":"Commenti"},{"$f":"IF(Summary!$V$3=1,\"Distanza Km\",\"Distance Km\")","v":"Distanza Km"},{"$f":"IF(Summary!$V$3=1,\"Punti\",\"Points\")","v":"Punti"},{"$f":"IF(Summary!$V$3=1,\"AZIMUT (Tuo)\",\"Heading (own)\")","v":"AZIMUT (Tuo)"},{"$f":"IF(Summary!$V$3=1,\"AZIMUT (Corrispondente)\",\"Heading (Other)\")","v":"AZIMUT (Corrispondente)"},{"$f":"IF(Summary!$V$3=1,\"DIGITALE?\",\"DIGITAL?\")","v":"DIGITALE?"},null,null,null,null,null,null,null,"Local Lat","Dist Lat","Diff Long",null,"Path Rad",null,null,null,null,null,null,null,null,null,null,"Dist Lat","Local Lat","Diff Long",null,"Path Rad",null,null,null,null,"Back"]
[null,null,null,null,null,null,null,null,null,null,null,null,null,null,null,null,null,null,null,"Longitude",null,null,null,"Latitude","A","B","L","E","D","Dcond","F1cond","F2cond","F3cond","Bearing",null,"R","Rint   km",null,null,"A","B","L","E","D","Dcond","F1cond","F2cond","F3cond","Bearing",null,null,null,"dx","call","locator","nr. QSO's","total km's"]
[null,null,null,"P",0,null,"P",0,"001",null,null,null,{"$f":"IF(K12<>\"\",AK12,0)","v":0},{"$f":"(IF(E12>1,M12,0)*$M$6/2)+(IF(H12>1,M12,0)*$M$6/2)","v":0},{"$f":"IF(K12<>0,AH12,\"\")","v":""},{"$f":"IF(K12<>0,AW12,\"\")","v":""},null,false,null,0,null,null,null,0,{"$f":"$X$8/$Z$4","v":0},{"$f":"X12/$Z$4","v":0},{"$f":"(T12-$T$8)*2/$Z$4","v":0},{"$f":"SIN(Y12)*SIN(Z12)+COS(Y12)*COS(Z12)*COS(AA12)","v":1},{"$f":"ATAN(SQRT(1-AB12*AB12)/AB12)","v":0},{"$f":"IF(AC12<0,180/$Z$4+AC12,AC12)","v":0},{"$f":"IF(Y12<>Z12,90*(1+ABS(Y12-Z12)/(Y12-Z12)))","v":false},{"$f":"IF(AA12<>0,90+$Z$4*ATAN((SIN(Y12)*AB12-SIN(Z12))/(SIN(AA12)*COS(Y12)^2)),AE12*1)","v":0},{"$f":"IF(SIN(AA12)<0,AF12+180,AF12*1)","v":0},{"$f":"INT(AG12)","v":0},null,{"$f":"6365.11*AD12","v":0},{"$f":"IF(AJ12<5,5,INT(AJ12+0.5))","v":5},null,null,{"$f":"X12/$Z$4","v":0},{"$f":"$X$8/$Z$4","v":0},{"$f":"($T$8-T12)*2/$Z$4","v":0},{"$f":"SIN(AN12)*SIN(AO12)+COS(AN12)*COS(AO12)*COS(AP12)","v":1},{"$f":"ATAN(SQRT(1-AQ12*AQ12)/AQ12)","v":0},{"$f":"IF(AC12<0,180/$Z$4+AC12,AC12)","v":0},{"$f":"IF(AN12<>AO12,90*(1+ABS(AN12-AO12)/(AN12-AO12)))","v":false},{"$f":"IF(AP12<>0,90+$Z$4*ATAN((SIN(AN12)*AQ12-SIN(AO12))/(SIN(AP12)*COS(AN12)^2)),AT12*1)","v":0},{"$f":"IF(SIN(AP12)<0,AU12+180,AU12*1)","v":0},{"$f":"INT(AV12)","v":0},null,null,null,{"$f":"M12","v":0},{"$f":"C12","v":0},{"$f":"K12","v":0},0,0]
[null,null,null,"P",0,null,"P",0,"002",null,null,null,{"$f":"IF(K13<>\"\",AK13,0)","v":0},{"$f":"(IF(E13>1,M13,0)*$M$6/2)+(IF(H13>1,M13,0)*$M$6/2)","v":0},{"$f":"IF(K13<>0,AH13,\"\")","v":""},{"$f":"IF(K13<>0,AW13,\"\")","v":""},null,false,null,0,null,null,null,0,{"$f":"$X$8/$Z$4","v":0},{"$f":"X13/$Z$4","v":0},{"$f":"(T13-$T$8)*2/$Z$4","v":0},{"$f":"SIN(Y13)*SIN(Z13)+COS(Y13)*COS(Z13)*COS(AA13)","v":1},{"$f":"ATAN(SQRT(1-AB13*AB13)/AB13)","v":0},{"$f":"IF(AC13<0,180/$Z$4+AC13,AC13)","v":0},false,{"$f":"IF(AA13<>0,90+$Z$4*ATAN((SIN(Y13)*AB13-SIN(Z13))/(SIN(AA13)*COS(Y13)^2)),AE13*1)","v":0},{"$f":"IF(SIN(AA13)<0,AF13+180,AF13*1)","v":0},{"$f":"INT(AG13)","v":0},null,{"$f":"6365.11*AD13","v":0},5,null,null,0,0,0,1,0,0,false,0,0,0,null,null,null,{"$f":"M13","v":0},{"$f":"C13","v":0},{"$f":"K13","v":0}]
[null,null,null,"P",0,null,"P",0,"003",null,null,null,0,0,{"$f":"IF(K14<>0,AH14,\"\")","v":""},{"$f":"IF(K14<>0,AW14,\"\")","v":""},null,false,null,0,null,null,null,0,0,0,0,1,0,0,false,0,0,0,null,{"$f":"6365.11*AD14","v":0},5,null,null,0,0,0,1,0,0,false,0,0,0,null,null,null,0,0,0]
[null,null,null,"P",0,null,"P",0,"004",null,null,null,0,0,"","",null,false,null,0,null,null,null,0,0,0,0,1,0,0,false,0,0,0,null,0,5,null,null,0,0,0,1,0,0,false,0,0,0,null,null,null,0,0,0]
[null,null,null,"P",0,null,"P",0,"005",null,null,null,0,0,"","",null,false,null,0,null,null,null,0,0,0,0,1,0,0,false,0,0,0,null,0,5,null,null,0,0,0,1,0,0,false,0,0,0,null,null,null,0,0,0]
[null,null,null,"P",0,null,"P",0,"006",null,null,null,0,0,"","",null,false,null,0,null,null,null,0,0,0,0,1,0,0,false,0,0,0,null,0,5,null,null,0,0,0,1,0,0,false,0,0,0,null,null,null,0,0,0]
[null,null,null,"P",0,null,"P",0,"007",null,null,null,0,0,"","",null,false,null,0,null,null,null,0,0,0,0,1,0,0,false,0,0,0,null,0,5,null,null,0,0,0,1,0,0,false,0,0,0,null,null,null,0,0,0]
[null,null,null,"P",0,null,"P",0,"008",null,null,null,0,0,"","",null,false,null,0,null,null,null,0,0,0,0,1,0,0,false,0,0,0,null,0,5,null,null,0,0,0,1,0,0,false,0,0,0,null,null,null,0,0,0]
[null,null,null,"P",0,null,"P",0,"009",null,null,null,0,0,"","",null,false,null,0,null,null,null,0,0,0,0,1,0,0,false,0,0,0,null,0,5,null,null,0,0,0,1,0,0,false,0,0,0,null,null,null,0,0,0]
[null,null,null,"P",0,null,"P",0,"010",null,null,null,0,0,"","",null,false,null,0,null,null,null,0,0,0,0,1,0,0,false,0,0,0,null,0,5,null,null,0,0,0,1,0,0,false,0,0,0,null,null,null,0,0,0]
[null,null,null,"P",0,null,"P",0,"011",null,null,null,0,0,"","",null,false,null,0,null,null,null,0,0,0,0,1,0,0,false,0,0,0,null,0,5,null,null,0,0,0,1,0,0,false,0,0,0,null,null,null,0,0,0]
[null,null,null,"P",0,null,"P",0,"012",null,null,null,0,0,"","",null,false,null,0,null,null,null,0,0,0,0,1,0,0,false,0,0,0,null,0,5,null,null,0,0,0,1,0,0,false,0,0,0,null,null,null,0,0,0]
[null,null,null,"P",0,null,"P",0,"013",null,null,null,0,0,"","",null,false,null,0,null,null,null,0,0,0,0,1,0,0,false,0,0,0,null,0,5,null,null,0,0,0,1,0,0,false,0,0,0,null,null,null,0,0,0]
[null,null,null,"P",0,null,"P",0,"014",null,null,null,0,0,"","",null,false,null,0,null,null,null,0,0,0,0,1,0,0,false,0,0,0,null,0,5,null,null,0,0,0,1,0,0,false,0,0,0,null,null,null,0,0,0]
[null,null,null,"P",0,null,"P",0,"015",null,null,null,0,0,"","",null,false,null,0,null,null,null,0,0,0,0,1,0,0,false,0,0,0,null,0,5,null,null,0,0,0,1,0,0,false,0,0,0,null,null,null,0,0,0]
[null,null,null,"P",0,null,"P",0,"016",null,null,null,0,0,{"$f":"IF(K27<>0,AH27,\"\")","v":""},{"$f":"IF(K27<>0,AW27,\"\")","v":""},null,false,null,0,null,null,null,0,0,{"$f":"X27/$Z$4","v":0},{"$f":"(T27-$T$8)*2/$Z$4","v":0},{"$f":"SIN(Y27)*SIN(Z27)+COS(Y27)*COS(Z27)*COS(AA27)","v":1},0,0,{"$f":"IF(Y27<>Z27,90*(1+ABS(Y27-Z27)/(Y27-Z27)))","v":false},{"$f":"IF(AA27<>0,90+$Z$4*ATAN((SIN(Y27)*AB27-SIN(Z27))/(SIN(AA27)*COS(Y27)^2)),AE27*1)","v":0},{"$f":"IF(SIN(AA27)<0,AF27+180,AF27*1)","v":0},0,null,{"$f":"6365.11*AD27","v":0},5,null,null,{"$f":"X27/$Z$4","v":0},0,{"$f":"($T$8-T27)*2/$Z$4","v":0},{"$f":"SIN(AN27)*SIN(AO27)+COS(AN27)*COS(AO27)*COS(AP27)","v":1},0,{"$f":"IF(AC27<0,180/$Z$4+AC27,AC27)","v":0},{"$f":"IF(AN27<>AO27,90*(1+ABS(AN27-AO27)/(AN27-AO27)))","v":false},{"$f":"IF(AP27<>0,90+$Z$4*ATAN((SIN(AN27)*AQ27-SIN(AO27))/(SIN(AP27)*COS(AN27)^2)),AT27*1)","v":0},{"$f":"IF(SIN(AP27)<0,AU27+180,AU27*1)","v":0},0,null,null,null,{"$f":"M27","v":0},{"$f":"C27","v":0},{"$f":"K27","v":0}]
[null,null,null,"P",0,null,"P",0,"017",null,null,null,0,0,{"$f":"IF(K28<>0,AH28,\"\")","v":""},{"$f":"IF(K28<>0,AW28,\"\")","v":""},null,false,null,0,null,null,null,0,0,{"$f":"X28/$Z$4","v":0},{"$f":"(T28-$T$8)*2/$Z$4","v":0},{"$f":"SIN(Y28)*SIN(Z28)+COS(Y28)*COS(Z28)*COS(AA28)","v":1},0,0,{"$f":"IF(Y28<>Z28,90*(1+ABS(Y28-Z28)/(Y28-Z28)))","v":false},{"$f":"IF(AA28<>0,90+$Z$4*ATAN((SIN(Y28)*AB28-SIN(Z28))/(SIN(AA28)*COS(Y28)^2)),AE28*1)","v":0},{"$f":"IF(SIN(AA28)<0,AF28+180,AF28*1)","v":0},0,null,{"$f":"6365.11*AD28","v":0},5,null,null,{"$f":"X28/$Z$4","v":0},0,{"$f":"($T$8-T28)*2/$Z$4","v":0},{"$f":"SIN(AN28)*SIN(AO28)+COS(AN28)*COS(AO28)*COS(AP28)","v":1},0,{"$f":"IF(AC28<0,180/$Z$4+AC28,AC28)","v":0},{"$f":"IF(AN28<>AO28,90*(1+ABS(AN28-AO28)/(AN28-AO28)))","v":false},{"$f":"IF(AP28<>0,90+$Z$4*ATAN((SIN(AN28)*AQ28-SIN(AO28))/(SIN(AP28)*COS(AN28)^2)),AT28*1)","v":0},{"$f":"IF(SIN(AP28)<0,AU28+180,AU28*1)","v":0},0,null,null,null,{"$f":"M28","v":0},{"$f":"C28","v":0},{"$f":"K28","v":0}]
[null,null,null,"P",0,null,"P",0,"018",null,null,null,0,0,"","",null,false,null,0,null,null,null,0,0,0,0,1,0,0,false,0,0,0,null,0,5,null,null,0,0,0,1,0,0,false,0,0,0,null,null,null,0,0,0]
[null,null,null,"P",0,null,"P",0,"019",null,null,null,0,0,{"$f":"IF(K30<>0,AH30,\"\")","v":""},{"$f":"IF(K30<>0,AW30,\"\")","v":""},null,false,null,0,null,null,null,0,0,{"$f":"X30/$Z$4","v":0},{"$f":"(T30-$T$8)*2/$Z$4","v":0},{"$f":"SIN(Y30)*SIN(Z30)+COS(Y30)*COS(Z30)*COS(AA30)","v":1},0,0,{"$f":"IF(Y30<>Z30,90*(1+ABS(Y30-Z30)/(Y30-Z30)))","v":false},{"$f":"IF(AA30<>0,90+$Z$4*ATAN((SIN(Y30)*AB30-SIN(Z30))/(SIN(AA30)*COS(Y30)^2)),AE30*1)","v":0},{"$f":"IF(SIN(AA30)<0,AF30+180,AF30*1)","v":0},0,null,{"$f":"6365.11*AD30","v":0},5,null,null,{"$f":"X30/$Z$4","v":0},0,{"$f":"($T$8-T30)*2/$Z$4","v":0},{"$f":"SIN(AN30)*SIN(AO30)+COS(AN30)*COS(AO30)*COS(AP30)","v":1},0,{"$f":"IF(AC30<0,180/$Z$4+AC30,AC30)","v":0},{"$f":"IF(AN30<>AO30,90*(1+ABS(AN30-AO30)/(AN30-AO30)))","v":false},{"$f":"IF(AP30<>0,90+$Z$4*ATAN((SIN(AN30)*AQ30-SIN(AO30))/(SIN(AP30)*COS(AN30)^2)),AT30*1)","v":0},{"$f":"IF(SIN(AP30)<0,AU30+180,AU30*1)","v":0},0,null,null,null,{"$f":"M30","v":0},{"$f":"C30","v":0},{"$f":"K30","v":0}]
[null,null,null,"P",0,null,"P",0,"020",null,null,null,0,0,{"$f":"IF(K31<>0,AH31,\"\")","v":""},{"$f":"IF(K31<>0,AW31,\"\")","v":""},null,false,null,0,null,null,null,0,0,{"$f":"X31/$Z$4","v":0},{"$f":"(T31-$T$8)*2/$Z$4","v":0},{"$f":"SIN(Y31)*SIN(Z31)+COS(Y31)*COS(Z31)*COS(AA31)","v":1},0,0,{"$f":"IF(Y31<>Z31,90*(1+ABS(Y31-Z31)/(Y31-Z31)))","v":false},{"$f":"IF(AA31<>0,90+$Z$4*ATAN((SIN(Y31)*AB31-SIN(Z31))/(SIN(AA31)*COS(Y31)^2)),AE31*1)","v":0},{"$f":"IF(SIN(AA31)<0,AF31+180,AF31*1)","v":0},0,null,{"$f":"6365.11*AD31","v":0},5,null,null,{"$f":"X31/$Z$4","v":0},0,{"$f":"($T$8-T31)*2/$Z$4","v":0},{"$f":"SIN(AN31)*SIN(AO31)+COS(AN31)*COS(AO31)*COS(AP31)","v":1},0,{"$f":"IF(AC31<0,180/$Z$4+AC31,AC31)","v":0},{"$f":"IF(AN31<>AO31,90*(1+ABS(AN31-AO31)/(AN31-AO31)))","v":false},{"$f":"IF(AP31<>0,90+$Z$4*ATAN((SIN(AN31)*AQ31-SIN(AO31))/(SIN(AP31)*COS(AN31)^2)),AT31*1)","v":0},{"$f":"IF(SIN(AP31)<0,AU31+180,AU31*1)","v":0},0,null,null,null,{"$f":"M31","v":0},{"$f":"C31","v":0},{"$f":"K31","v":0}]
[null,null,null,"P",0,null,"P",0,"021",null,null,null,0,0,"","",null,false,null,0,null,null,null,0,0,0,0,1,0,0,false,0,0,0,null,0,5,null,null,0,0,0,1,0,0,false,0,0,0,null,null,null,0,0,0]
[null,null,null,"P",0,null,"P",0,"022",null,null,null,0,0,"","",null,false,null,0,null,null,null,0,0,0,0,1,0,0,false,0,0,0,null,0,5,null,null,0,0,0,1,0,0,false,0,0,0,null,null,null,0,0,0]
[null,null,null,"P",0,null,"P",0,"023",null,null,null,0,0,"","",null,false,null,0,null,null,null,0,0,0,0,1,0,0,false,0,0,0,null,0,5,null,null,0,0,0,1,0,0,false,0,0,0,null,null,null,0,0,0]
[null,null,null,"P",0,null,"P",0,"024",null,null,null,0,0,"","",null,false,null,0,null,null,null,0,0,0,0,1,0,0,false,0,0,0,null,0,5,null,null,0,0,0,1,0,0,false,0,0,0,null,null,null,0,0,0]
[null,null,null,"P",0,null,"P",0,"025",null,null,null,0,0,"","",null,false,null,0,null,null,null,0,0,0,0,1,0,0,false,0,0,0,null,0,5,null,null,0,0,0,1,0,0,false,0,0,0,null,null,null,0,0,0]
[null,null,null,"P",0,null,"P",0,"026",null,null,null,0,0,"","",null,false,null,0,null,null,null,0,0,0,0,1,0,0,false,0,0,0,null,0,5,null,null,0,0,0,1,0,0,false,0,0,0,null,null,null,0,0,0]
[null,null,null,"P",0,null,"P",0,"027",null,null,null,0,0,"","",null,false,null,0,null,null,null,0,0,0,0,1,0,0,false,0,0,0,null,0,5,null,null,0,0,0,1,0,0,false,0,0,0,null,null,null,0,0,0]
[null,null,null,"P",0,null,"P",0,"028",null,null,null,0,0,"","",null,false,null,0,null,null,null,0,0,0,0,1,0,0,false,0,0,0,null,0,5,null,null,0,0,0,1,0,0,false,0,0,0,null,null,null,0,0,0]
[null,null,null,"P",0,null,"P",0,"029",null,null,null,0,0,"","",null,false,null,0,null,null,null,0,0,0,0,1,0,0,false,0,0,0,null,0,5,null,null,0,0,0,1,0,0,false,0,0,0,null,null,null,0,0,0]
[null,null,null,"P",0,null,"P",0,"030",null,null,null,0,0,{"$f":"IF(K41<>0,AH41,\"\")","v":""},{"$f":"IF(K41<>0,AW41,\"\")","v":""},null,false,null,0,null,null,null,0,0,{"$f":"X41/$Z$4","v":0},{"$f":"(T41-$T$8)*2/$Z$4","v":0},{"$f":"SIN(Y41)*SIN(Z41)+COS(Y41)*COS(Z41)*COS(AA41)","v":1},0,0,{"$f":"IF(Y41<>Z41,90*(1+ABS(Y41-Z41)/(Y41-Z41)))","v":false},{"$f":"IF(AA41<>0,90+$Z$4*ATAN((SIN(Y41)*AB41-SIN(Z41))/(SIN(AA41)*COS(Y41)^2)),AE41*1)","v":0},{"$f":"IF(SIN(AA41)<0,AF41+180,AF41*1)","v":0},0,null,{"$f":"6365.11*AD41","v":0},5,null,null,{"$f":"X41/$Z$4","v":0},0,{"$f":"($T$8-T41)*2/$Z$4","v":0},{"$f":"SIN(AN41)*SIN(AO41)+COS(AN41)*COS(AO41)*COS(AP41)","v":1},0,{"$f":"IF(AC41<0,180/$Z$4+AC41,AC41)","v":0},{"$f":"IF(AN41<>AO41,90*(1+ABS(AN41-AO41)/(AN41-AO41)))","v":false},{"$f":"IF(AP41<>0,90+$Z$4*ATAN((SIN(AN41)*AQ41-SIN(AO41))/(SIN(AP41)*COS(AN41)^2)),AT41*1)","v":0},{"$f":"IF(SIN(AP41)<0,AU41+180,AU41*1)","v":0},0,null,null,null,{"$f":"M41","v":0},{"$f":"C41","v":0},{"$f":"K41","v":0}]
[null,null,null,"P",0,null,"P",0,"031",null,null,null,0,0,{"$f":"IF(K42<>0,AH42,\"\")","v":""},{"$f":"IF(K42<>0,AW42,\"\")","v":""},null,false,null,0,null,null,null,0,0,{"$f":"X42/$Z$4","v":0},{"$f":"(T42-$T$8)*2/$Z$4","v":0},{"$f":"SIN(Y42)*SIN(Z42)+COS(Y42)*COS(Z42)*COS(AA42)","v":1},0,0,{"$f":"IF(Y42<>Z42,90*(1+ABS(Y42-Z42)/(Y42-Z42)))","v":false},{"$f":"IF(AA42<>0,90+$Z$4*ATAN((SIN(Y42)*AB42-SIN(Z42))/(SIN(AA42)*COS(Y42)^2)),AE42*1)","v":0},{"$f":"IF(SIN(AA42)<0,AF42+180,AF42*1)","v":0},0,null,{"$f":"6365.11*AD42","v":0},5,null,null,{"$f":"X42/$Z$4","v":0},0,{"$f":"($T$8-T42)*2/$Z$4","v":0},{"$f":"SIN(AN42)*SIN(AO42)+COS(AN42)*COS(AO42)*COS(AP42)","v":1},0,{"$f":"IF(AC42<0,180/$Z$4+AC42,AC42)","v":0},{"$f":"IF(AN42<>AO42,90*(1+ABS(AN42-AO42)/(AN42-AO42)))","v":false},{"$f":"IF(AP42<>0,90+$Z$4*ATAN((SIN(AN42)*AQ42-SIN(AO42))/(SIN(AP42)*COS(AN42)^2)),AT42*1)","v":0},{"$f":"IF(SIN(AP42)<0,AU42+180,AU42*1)","v":0},0,null,null,null,{"$f":"M42","v":0},{"$f":"C42","v":0},{"$f":"K42","v":0}]
[null,null,null,"P",0,null,"P",0,"032",null,null,null,0,0,"","",null,false,null,0,null,null,null,0,0,0,0,1,0,0,false,0,0,0,null,0,5,null,null,0,0,0,1,0,0,false,0,0,0,null,null,null,0,0,0]
[null,null,null,"P",0,null,"P",0,"033",null,null,null,0,0,"","",null,false,null,0,null,null,null,0,0,0,0,1,0,0,false,0,0,0,null,0,5,null,null,0,0,0,1,0,0,false,0,0,0,null,null,null,0,0,0]
[null,null,null,"P",0,null,"P",0,"034",null,null,null,0,0,"","",null,false,null,0,null,null,null,0,0,0,0,1,0,0,false,0,0,0,null,0,5,null,null,0,0,0,1,0,0,false,0,0,0,null,null,null,0,0,0]
[null,null,null,"P",0,null,"P",0,"035",null,null,null,0,0,"","",null,false,null,0,null,null,null,0,0,0,0,1,0,0,false,0,0,0,null,0,5,null,null,0,0,0,1,0,0,false,0,0,0,null,null,null,0,0,0]
[null,null,null,"P",0,null,"P",0,"036",null,null,null,0,0,"","",null,false,null,0,null,null,null,0,0,0,0,1,0,0,false,0,0,0,null,0,5,null,null,0,0,0,1,0,0,false,0,0,0,null,null,null,0,0,0]
[null,null,null,"P",0,null,"P",0,"037",null,null,null,0,0,"","",null,false,null,0,null,null,null,0,0,0,0,1,0,0,false,0,0,0,null,0,5,null,null,0,0,0,1,0,0,false,0,0,0,null,null,null,0,0,0]
[null,null,null,"P",0,null,"P",0,"038",null,null,null,0,0,"","",null,false,null,0,null,null,null,0,0,0,0,1,0,0,false,0,0,0,null,0,5,null,null,0,0,0,1,0,0,false,0,0,0,null,null,null,0,0,0]
[null,null,null,"P",0,null,"P",0,"039",null,null,null,0,0,"","",null,false,null,0,null,null,null,0,0,0,0,1,0,0,false,0,0,0,null,0,5,null,null,0,0,0,1,0,0,false,0,0,0,null,null,null,0,0,0]
[null,null,null,"P",0,null,"P",0,"040",null,null,null,0,0,"","",null,false,null,0,null,null,null,0,0,0,0,1,0,0,false,0,0,0,null,0,5,null,null,0,0,0,1,0,0,false,0,0,0,null,null,null,0,0,0]
[null,null,null,"P",0,null,"P",0,"041",null,null,null,0,0,"","",null,false,null,0,null,null,null,0,0,0,0,1,0,0,false,0,0,0,null,0,5,null,null,0,0,0,1,0,0,false,0,0,0,null,null,null,0,0,0]
[null,null,null,"P",0,null,"P",0,"042",null,null,null,0,0,"","",null,false,null,0,null,null,null,0,0,0,0,1,0,0,false,0,0,0,null,0,5,null,null,0,0,0,1,0,0,false,0,0,0,null,null,null,0,0,0]
[null,null,null,"P",0,null,"P",0,"043",null,null,null,0,0,"","",null,false,null,0,null,null,null,0,0,0,0,1,0,0,false,0,0,0,null,0,5,null,null,0,0,0,1,0,0,false,0,0,0,null,null,null,0,0,0]
[null,null,null,"P",0,null,"P",0,"044",null,null,null,0,0,"","",null,false,null,0,null,null,null,0,0,0,0,1,0,0,false,0,0,0,null,0,5,null,null,0,0,0,1,0,0,false,0,0,0,null,null,null,0,0,0]
[null,null,null,"P",0,null,"P",0,"045",null,null,null,0,0,"","",null,false,null,0,null,null,null,0,0,0,0,1,0,0,false,0,0,0,null,0,5,null,null,0,0,0,1,0,0,false,0,0,0,null,null,null,0,0,0]
[null,null,null,"P",0,null,"P",0,"046",null,null,null,0,0,"","",null,false,null,0,null,null,null,0,0,0,0,1,0,0,false,0,0,0,null,0,5,null,null,0,0,0,1,0,0,false,0,0,0,null,null,null,0,0,0]
[null,null,null,"P",0,null,"P",0,"047",null,null,null,0,0,"","",null,false,null,0,null,null,null,0,0,0,0,1,0,0,false,0,0,0,null,0,5,null,null,0,0,0,1,0,0,false,0,0,0,null,null,null,0,0,0]
[null,null,null,"P",0,null,"P",0,"048",null,null,null,0,0,"","",null,false,null,0,null,null,null,0,0,0,0,1,0,0,false,0,0,0,null,0,5,null,null,0,0,0,1,0,0,false,0,0,0,null,null,null,0,0,0]
[null,null,null,"P",0,null,"P",0,"049",null,null,null,0,0,"","",null,false,null,0,null,null,null,0,0,0,0,1,0,0,false,0,0,0,null,0,5,null,null,0,0,0,1,0,0,false,0,0,0,null,null,null,0,0,0]
[null,null,null,"P",0,null,"P",0,"050",null,null,null,{"$f":"IF(K61<>\"\",AK61,0)","v":0},0,"","",null,false,null,0,null,null,null,0,0,0,0,1,0,0,false,0,0,0,null,0,5,null,null,0,0,0,1,0,0,false,0,0,0,null,null,null,0,0,0]
[null,null,null,null,null,null,null,null,null,null,null,null,null,null,null,null,null,null,null,null,null,null,null,null,null,null,null,null,null,null,null,null,null,null,null,null,null,null,null,null,null,null,null,null,null,null,null,null,null,null,null,null,null,null,null,0]

{"sheet":"70cm","index":5,"n_rows":62,"n_cols":57,"rows_kept":62,"cut":false,"hidden":false,"merged":[[7,2,7,3],[7,9,7,10],[3,6,3,8],[0,0,0,16],[7,7,7,8],[9,16,10,16],[9,1,10,1],[9,2,10,2],[9,3,10,5],[9,6,10,8],[9,9,10,9],[9,10,10,10],[9,11,10,11],[9,12,10,12],[9,13,10,13],[9,14,10,14],[9,15,10,15],[9,0,10,0],[5,2,5,7]]}
["ATV CONTEST LOG  70 cm"]
[]
[]
[null,null,null,null,null,null,null,null,null,null,null,{"$f":"IF(Summary!$V$3=1,\"Banda:\",\"Band:\")","v":"Banda:"},70,"cm",{"$f":"IF(Summary!$V$3=1,\"Analogico:\",\"Analogic\")","v":"Analogico:"},{"$f":"SUMIF($R$12:$R$61,\"=FALSO\",$N$12:$N$61)","v":0},null,null,null,null,null,null,null,null,"Deg/Rad :",{"$f":"180/PI()","v":57.295779513082323}]
[]
[{"$f":"IF(Summary!$V$3=1,\"Data:\",\"Date:\")","v":"Data:"},null,{"$f":"IF(Summary!B3=\"\",\"\",Summary!B3)","v":"2022-07-10"},null,null,null,null,null,null,null,null,{"$f":"IF(Summary!$V$3=1,\"Moltiplicatore:\",\"Multiplier:\")","v":"Moltiplicatore:"},{"$f":"Summary!$AI$40","v":8},null,{"$f":"IF(Summary!$V$3=1,\"Totale:\",\"Total:\")","v":"Totale:"},{"$f":"SUM(N12:N61)","v":0},{"$f":"IF(M4=70,1,IF(M4=24,2,IF(M4=23,2,IF(M4=13,5))))","v":1},{"$f":"IF(M4=9,\"5\",IF(M4=6,\"5\",IF(M4=3,\"5\",IF(M4=1.3,\"5\"))))","v":false},{"$f":"IF(M4=1.2,\"5\",IF(M4=0.6,\"5\",IF(M4=0.7,\"5\")))","v":false},"Longitude",null,null,null,"Latitude"]
[]
[{"$f":"IF(Summary!$V$3=1,\"Codice:\",\"Code:\")","v":"Codice:"},null,{"$f":"Summary!$B$23","v":0},null,null,null,null,{"$f":"IF(Summary!$V$3=1,\"Nominativo:\",\"Call:\")","v":"Nominativo:"},null,{"$f":"Summary!B5","v":0},null,{"$f":"IF(Summary!$V$3=1,\"Locatore WW:\",\"WW Locator:\")","v":"Locatore WW:"},{"$f":"Summary!B15","v":0},null,{"$f":"IF(Summary!$V$3=1,\"Digitale:\",\"Digital:\")","v":"Digitale:"},{"$f":"SUMIF($R$12:$R$61,\"=VERO\",$N$12:$N$61)","v":0},null,null,null,0,null,null,null,0]
[]
[{"$f":"IF(Summary!$V$3=1,\"Data\",\"Date\")","v":"Data"},{"$f":"IF(Summary!$V$3=1,\"Ora UTC\",\"Time UTC\")","v":"Ora UTC"},{"$f":"IF(Summary!$V$3=1,\"Stazioni Collegate\",\"Stations Worked\")","v":"Stazioni Collegate"},{"$f":"IF(Summary!$V$3=1,\"Rprt.+ Sequenza Ricevuta\",\"Rprt.+ Sequence Received\")","v":"Rprt.+ Sequenza Ricevuta"},null,null,{"$f":"IF(Summary!$V$3=1,\"Rpt.+ Sequenza Inviata\",\"Rpt.+ Sequence Sent\")","v":"Rpt.+ Sequenza Inviata"},null,null,{"$f":"IF(Summary!$V$3=1,\"Codice Ricevuto\",\"Code Received\")","v":"Codice Ricevuto"},{"$f":"IF(Summary!$V$3=1,\"Locatore WW\",\"WW Locator\")","v":"Locatore WW"},{"$f":"IF(Summary!$V$3=1,\"Commenti\",\"Comments\")","v":"Commenti"},{"$f":"IF(Summary!$V$3=1,\"Distanza Km\",\"Distance Km\")","v":"Distanza Km"},{"$f":"IF(Summary!$V$3=1,\"Punti\",\"Points\")","v":"Punti"},{"$f":"IF(Summary!$V$3=1,\"AZIMUT (Tuo)\",\"Heading (own)\")","v":"AZIMUT (Tuo)"},{"$f":"IF(Summary!$V$3=1,\"AZIMUT (Corrispondente)\",\"Heading (Other)\")","v":"AZIMUT (Corrispondente)"},{"$f":"IF(Summary!$V$3=1,\"DIGITALE?\",\"DIGITAL?\")","v":"DIGITALE?"},null,null,null,null,null,null,null,"Local Lat","Dist Lat","Diff Long",null,"Path Rad",null,null,null,null,null,null,null,null,null,null,"Dist Lat","Local Lat","Diff Long",null,"Path Rad",null,null,null,null,"Back"]
[null,null,null,null,null,null,null,null,null,null,null,null,null,null,null,null,null,null,null,"Longitude",null,null,null,"Latitude","A","B","L","E","D","Dcond","F1cond","F2cond","F3cond","Bearing",null,"R","Rint   km",null,null,"A","B","L","E","D","Dcond","F1cond","F2cond","F3cond","Bearing",null,null,null,"dx","call","locator","nr. QSO's","total km's"]
[null,null,null,"P",0,null,"P",0,"001",null,null,null,{"$f":"IF(K12<>\"\",AK12,0)","v":0},{"$f":"(IF(E12>1,M12,0)*$M$6/2)+(IF(H12>1,M12,0)*$M$6/2)","v":0},{"$f":"IF(K12<>0,AH12,\"\")","v":""},{"$f":"IF(K12<>0,AW12,\"\")","v":""},null,false,null,0,null,null,null,0,{"$f":"$X$8/$Z$4","v":0},{"$f":"X12/$Z$4","v":0},{"$f":"(T12-$T$8)*2/$Z$4","v":0},{"$f":"SIN(Y12)*SIN(Z12)+COS(Y12)*COS(Z12)*COS(AA12)","v":1},{"$f":"ATAN(SQRT(1-AB12*AB12)/AB12)","v":0},{"$f":"IF(AC12<0,180/$Z$4+AC12,AC12)","v":0},{"$f":"IF(Y12<>Z12,90*(1+ABS(Y12-Z12)/(Y12-Z12)))","v":false},{"$f":"IF(AA12<>0,90+$Z$4*ATAN((SIN(Y12)*AB12-SIN(Z12))/(SIN(AA12)*COS(Y12)^2)),AE12*1)","v":0},{"$f":"IF(SIN(AA12)<0,AF12+180,AF12*1)","v":0},{"$f":"INT(AG12)","v":0},null,{"$f":"6365.11*AD12","v":0},{"$f":"IF(AJ12<5,5,INT(AJ12+0.5))","v":5},null,null,{"$f":"X12/$Z$4","v":0},{"$f":"$X$8/$Z$4","v":0},{"$f":"($T$8-T12)*2/$Z$4","v":0},{"$f":"SIN(AN12)*SIN(AO12)+COS(AN12)*COS(AO12)*COS(AP12)","v":1},{"$f":"ATAN(SQRT(1-AQ12*AQ12)/AQ12)","v":0},{"$f":"IF(AC12<0,180/$Z$4+AC12,AC12)","v":0},{"$f":"IF(AN12<>AO12,90*(1+ABS(AN12-AO12)/(AN12-AO12)))","v":false},{"$f":"IF(AP12<>0,90+$Z$4*ATAN((SIN(AN12)*AQ12-SIN(AO12))/(SIN(AP12)*COS(AN12)^2)),AT12*1)","v":0},{"$f":"IF(SIN(AP12)<0,AU12+180,AU12*1)","v":0},{"$f":"INT(AV12)","v":0},null,null,null,{"$f":"M12","v":0},{"$f":"C12","v":0},{"$f":"K12","v":0},0,0]
[null,null,null,"P",0,null,"P",0,"002",null,null,null,{"$f":"IF(K13<>\"\",AK13,0)","v":0},{"$f":"(IF(E13>1,M13,0)*$M$6/2)+(IF(H13>1,M13,0)*$M$6/2)","v":0},{"$f":"IF(K13<>0,AH13,\"\")","v":""},{"$f":"IF(K13<>0,AW13,\"\")","v":""},null,false,null,0,null,null,null,0,{"$f":"$X$8/$Z$4","v":0},{"$f":"X13/$Z$4","v":0},{"$f":"(T13-$T$8)*2/$Z$4","v":0},{"$f":"SIN(Y13)*SIN(Z13)+COS(Y13)*COS(Z13)*COS(AA13)","v":1},{"$f":"ATAN(SQRT(1-AB13*AB13)/AB13)","v":0},{"$f":"IF(AC13<0,180/$Z$4+AC13,AC13)","v":0},false,{"$f":"IF(AA13<>0,90+$Z$4*ATAN((SIN(Y13)*AB13-SIN(Z13))/(SIN(AA13)*COS(Y13)^2)),AE13*1)","v":0},{"$f":"IF(SIN(AA13)<0,AF13+180,AF13*1)","v":0},{"$f":"INT(AG13)","v":0},null,{"$f":"6365.11*AD13","v":0},5,null,null,0,0,0,1,0,0,false,0,0,0,null,null,null,{"$f":"M13","v":0},{"$f":"C13","v":0},{"$f":"K13","v":0}]
[null,null,null,"P",0,null,"P",0,"003",null,null,null,0,0,{"$f":"IF(K14<>0,AH14,\"\")","v":""},{"$f":"IF(K14<>0,AW14,\"\")","v":""},null,false,null,0,null,null,null,0,0,0,0,1,0,0,false,0,0,0,null,{"$f":"6365.11*AD14","v":0},5,null,null,0,0,0,1,0,0,false,0,0,0,null,null,null,0,0,0]
[null,null,null,"P",0,null,"P",0,"004",null,null,null,0,0,"","",null,false,null,0,null,null,null,0,0,0,0,1,0,0,false,0,0,0,null,0,5,null,null,0,0,0,1,0,0,false,0,0,0,null,null,null,0,0,0]
[null,null,null,"P",0,null,"P",0,"005",null,null,null,0,0,"","",null,false,null,0,null,null,null,0,0,0,0,1,0,0,false,0,0,0,null,0,5,null,null,0,0,0,1,0,0,false,0,0,0,null,null,null,0,0,0]
[null,null,null,"P",0,null,"P",0,"006",null,null,null,0,0,"","",null,false,null,0,null,null,null,0,0,0,0,1,0,0,false,0,0,0,null,0,5,null,null,0,0,0,1,0,0,false,0,0,0,null,null,null,0,0,0]
[null,null,null,"P",0,null,"P",0,"007",null,null,null,0,0,"","",null,false,null,0,null,null,null,0,0,0,0,1,0,0,false,0,0,0,null,0,5,null,null,0,0,0,1,0,0,false,0,0,0,null,null,null,0,0,0]
[null,null,null,"P",0,null,"P",0,"008",null,null,null,0,0,"","",null,false,null,0,null,null,null,0,0,0,0,1,0,0,false,0,0,0,null,0,5,null,null,0,0,0,1,0,0,false,0,0,0,null,null,null,0,0,0]
[null,null,null,"P",0,null,"P",0,"009",null,null,null,0,0,"","",null,false,null,0,null,null,null,0,0,0,0,1,0,0,false,0,0,0,null,0,5,null,null,0,0,0,1,0,0,false,0,0,0,null,null,null,0,0,0]
[null,null,null,"P",0,null,"P",0,"010",null,null,null,0,0,"","",null,false,null,0,null,null,null,0,0,0,0,1,0,0,false,0,0,0,null,0,5,null,null,0,0,0,1,0,0,false,0,0,0,null,null,null,0,0,0]
[null,null,null,"P",0,null,"P",0,"011",null,null,null,0,0,"","",null,false,null,0,null,null,null,0,0,0,0,1,0,0,false,0,0,0,null,0,5,null,null,0,0,0,1,0,0,false,0,0,0,null,null,null,0,0,0]
[null,null,null,"P",0,null,"P",0,"012",null,null,null,0,0,"","",null,false,null,0,null,null,null,0,0,0,0,1,0,0,false,0,0,0,null,0,5,null,null,0,0,0,1,0,0,false,0,0,0,null,null,null,0,0,0]
[null,null,null,"P",0,null,"P",0,"013",null,null,null,0,0,"","",null,false,null,0,null,null,null,0,0,0,0,1,0,0,false,0,0,0,null,0,5,null,null,0,0,0,1,0,0,false,0,0,0,null,null,null,0,0,0]
[null,null,null,"P",0,null,"P",0,"014",null,null,null,0,0,"","",null,false,null,0,null,null,null,0,0,0,0,1,0,0,false,0,0,0,null,0,5,null,null,0,0,0,1,0,0,false,0,0,0,null,null,null,0,0,0]
[null,null,null,"P",0,null,"P",0,"015",null,null,null,0,0,"","",null,false,null,0,null,null,null,0,0,0,0,1,0,0,false,0,0,0,null,0,5,null,null,0,0,0,1,0,0,false,0,0,0,null,null,null,0,0,0]
[null,null,null,"P",0,null,"P",0,"016",null,null,null,0,0,{"$f":"IF(K27<>0,AH27,\"\")","v":""},{"$f":"IF(K27<>0,AW27,\"\")","v":""},null,false,null,0,null,null,null,0,0,{"$f":"X27/$Z$4","v":0},{"$f":"(T27-$T$8)*2/$Z$4","v":0},{"$f":"SIN(Y27)*SIN(Z27)+COS(Y27)*COS(Z27)*COS(AA27)","v":1},0,0,{"$f":"IF(Y27<>Z27,90*(1+ABS(Y27-Z27)/(Y27-Z27)))","v":false},{"$f":"IF(AA27<>0,90+$Z$4*ATAN((SIN(Y27)*AB27-SIN(Z27))/(SIN(AA27)*COS(Y27)^2)),AE27*1)","v":0},{"$f":"IF(SIN(AA27)<0,AF27+180,AF27*1)","v":0},0,null,{"$f":"6365.11*AD27","v":0},5,null,null,{"$f":"X27/$Z$4","v":0},0,{"$f":"($T$8-T27)*2/$Z$4","v":0},{"$f":"SIN(AN27)*SIN(AO27)+COS(AN27)*COS(AO27)*COS(AP27)","v":1},0,{"$f":"IF(AC27<0,180/$Z$4+AC27,AC27)","v":0},{"$f":"IF(AN27<>AO27,90*(1+ABS(AN27-AO27)/(AN27-AO27)))","v":false},{"$f":"IF(AP27<>0,90+$Z$4*ATAN((SIN(AN27)*AQ27-SIN(AO27))/(SIN(AP27)*COS(AN27)^2)),AT27*1)","v":0},{"$f":"IF(SIN(AP27)<0,AU27+180,AU27*1)","v":0},0,null,null,null,{"$f":"M27","v":0},{"$f":"C27","v":0},{"$f":"K27","v":0}]
[null,null,null,"P",0,null,"P",0,"017",null,null,null,0,0,{"$f":"IF(K28<>0,AH28,\"\")","v":""},{"$f":"IF(K28<>0,AW28,\"\")","v":""},null,false,null,0,null,null,null,0,0,{"$f":"X28/$Z$4","v":0},{"$f":"(T28-$T$8)*2/$Z$4","v":0},{"$f":"SIN(Y28)*SIN(Z28)+COS(Y28)*COS(Z28)*COS(AA28)","v":1},0,0,{"$f":"IF(Y28<>Z28,90*(1+ABS(Y28-Z28)/(Y28-Z28)))","v":false},{"$f":"IF(AA28<>0,90+$Z$4*ATAN((SIN(Y28)*AB28-SIN(Z28))/(SIN(AA28)*COS(Y28)^2)),AE28*1)","v":0},{"$f":"IF(SIN(AA28)<0,AF28+180,AF28*1)","v":0},0,null,{"$f":"6365.11*AD28","v":0},5,null,null,{"$f":"X28/$Z$4","v":0},0,{"$f":"($T$8-T28)*2/$Z$4","v":0},{"$f":"SIN(AN28)*SIN(AO28)+COS(AN28)*COS(AO28)*COS(AP28)","v":1},0,{"$f":"IF(AC28<0,180/$Z$4+AC28,AC28)","v":0},{"$f":"IF(AN28<>AO28,90*(1+ABS(AN28-AO28)/(AN28-AO28)))","v":false},{"$f":"IF(AP28<>0,90+$Z$4*ATAN((SIN(AN28)*AQ28-SIN(AO28))/(SIN(AP28)*COS(AN28)^2)),AT28*1)","v":0},{"$f":"IF(SIN(AP28)<0,AU28+180,AU28*1)","v":0},0,null,null,null,{"$f":"M28","v":0},{"$f":"C28","v":0},{"$f":"K28","v":0}]
[null,null,null,"P",0,null,"P",0,"018",null,null,null,0,0,"","",null,false,null,0,null,null,null,0,0,0,0,1,0,0,false,0,0,0,null,0,5,null,null,0,0,0,1,0,0,false,0,0,0,null,null,null,0,0,0]
[null,null,null,"P",0,null,"P",0,"019",null,null,null,0,0,{"$f":"IF(K30<>0,AH30,\"\")","v":""},{"$f":"IF(K30<>0,AW30,\"\")","v":""},null,false,null,0,null,null,null,0,0,{"$f":"X30/$Z$4","v":0},{"$f":"(T30-$T$8)*2/$Z$4","v":0},{"$f":"SIN(Y30)*SIN(Z30)+COS(Y30)*COS(Z30)*COS(AA30)","v":1},0,0,{"$f":"IF(Y30<>Z30,90*(1+ABS(Y30-Z30)/(Y30-Z30)))","v":false},{"$f":"IF(AA30<>0,90+$Z$4*ATAN((SIN(Y30)*AB30-SIN(Z30))/(SIN(AA30)*COS(Y30)^2)),AE30*1)","v":0},{"$f":"IF(SIN(AA30)<0,AF30+180,AF30*1)","v":0},0,null,{"$f":"6365.11*AD30","v":0},5,null,null,{"$f":"X30/$Z$4","v":0},0,{"$f":"($T$8-T30)*2/$Z$4","v":0},{"$f":"SIN(AN30)*SIN(AO30)+COS(AN30)*COS(AO30)*COS(AP30)","v":1},0,{"$f":"IF(AC30<0,180/$Z$4+AC30,AC30)","v":0},{"$f":"IF(AN30<>AO30,90*(1+ABS(AN30-AO30)/(AN30-AO30)))","v":false},{"$f":"IF(AP30<>0,90+$Z$4*ATAN((SIN(AN30)*AQ30-SIN(AO30))/(SIN(AP30)*COS(AN30)^2)),AT30*1)","v":0},{"$f":"IF(SIN(AP30)<0,AU30+180,AU30*1)","v":0},0,null,null,null,{"$f":"M30","v":0},{"$f":"C30","v":0},{"$f":"K30","v":0}]
[null,null,null,"P",0,null,"P",0,"020",null,null,null,0,0,{"$f":"IF(K31<>0,AH31,\"\")","v":""},{"$f":"IF(K31<>0,AW31,\"\")","v":""},null,false,null,0,null,null,null,0,0,{"$f":"X31/$Z$4","v":0},{"$f":"(T31-$T$8)*2/$Z$4","v":0},{"$f":"SIN(Y31)*SIN(Z31)+COS(Y31)*COS(Z31)*COS(AA31)","v":1},0,0,{"$f":"IF(Y31<>Z31,90*(1+ABS(Y31-Z31)/(Y31-Z31)))","v":false},{"$f":"IF(AA31<>0,90+$Z$4*ATAN((SIN(Y31)*AB31-SIN(Z31))/(SIN(AA31)*COS(Y31)^2)),AE31*1)","v":0},{"$f":"IF(SIN(AA31)<0,AF31+180,AF31*1)","v":0},0,null,{"$f":"6365.11*AD31","v":0},5,null,null,{"$f":"X31/$Z$4","v":0},0,{"$f":"($T$8-T31)*2/$Z$4","v":0},{"$f":"SIN(AN31)*SIN(AO31)+COS(AN31)*COS(AO31)*COS(AP31)","v":1},0,{"$f":"IF(AC31<0,180/$Z$4+AC31,AC31)","v":0},{"$f":"IF(AN31<>AO31,90*(1+ABS(AN31-AO31)/(AN31-AO31)))","v":false},{"$f":"IF(AP31<>0,90+$Z$4*ATAN((SIN(AN31)*AQ31-SIN(AO31))/(SIN(AP31)*COS(AN31)^2)),AT31*1)","v":0},{"$f":"IF(SIN(AP31)<0,AU31+180,AU31*1)","v":0},0,null,null,null,{"$f":"M31","v":0},{"$f":"C31","v":0},{"$f":"K31","v":0}]
[null,null,null,"P",0,null,"P",0,"021",null,null,null,0,0,"","",null,false,null,0,null,null,null,0,0,0,0,1,0,0,false,0,0,0,null,0,5,null,null,0,0,0,1,0,0,false,0,0,0,null,null,null,0,0,0]
[null,null,null,"P",0,null,"P",0,"022",null,null,null,0,0,"","",null,false,null,0,null,null,null,0,0,0,0,1,0,0,false,0,0,0,null,0,5,null,null,0,0,0,1,0,0,false,0,0,0,null,null,null,0,0,0]
[null,null,null,"P",0,null,"P",0,"023",null,null,null,0,0,"","",null,false,null,0,null,null,null,0,0,0,0,1,0,0,false,0,0,0,null,0,5,null,null,0,0,0,1,0,0,false,0,0,0,null,null,null,0,0,0]
[null,null,null,"P",0,null,"P",0,"024",null,null,null,0,0,"","",null,false,null,0,null,null,null,0,0,0,0,1,0,0,false,0,0,0,null,0,5,null,null,0,0,0,1,0,0,false,0,0,0,null,null,null,0,0,0]
[null,null,null,"P",0,null,"P",0,"025",null,null,null,0,0,"","",null,false,null,0,null,null,null,0,0,0,0,1,0,0,false,0,0,0,null,0,5,null,null,0,0,0,1,0,0,false,0,0,0,null,null,null,0,0,0]
[null,null,null,"P",0,null,"P",0,"026",null,null,null,0,0,"","",null,false,null,0,null,null,null,0,0,0,0,1,0,0,false,0,0,0,null,0,5,null,null,0,0,0,1,0,0,false,0,0,0,null,null,null,0,0,0]
[null,null,null,"P",0,null,"P",0,"027",null,null,null,0,0,"","",null,false,null,0,null,null,null,0,0,0,0,1,0,0,false,0,0,0,null,0,5,null,null,0,0,0,1,0,0,false,0,0,0,null,null,null,0,0,0]
[null,null,null,"P",0,null,"P",0,"028",null,null,null,0,0,"","",null,false,null,0,null,null,null,0,0,0,0,1,0,0,false,0,0,0,null,0,5,null,null,0,0,0,1,0,0,false,0,0,0,null,null,null,0,0,0]
[null,null,null,"P",0,null,"P",0,"029",null,null,null,0,0,"","",null,false,null,0,null,null,null,0,0,0,0,1,0,0,false,0,0,0,null,0,5,null,null,0,0,0,1,0,0,false,0,0,0,null,null,null,0,0,0]
[null,null,null,"P",0,null,"P",0,"030",null,null,null,0,0,{"$f":"IF(K41<>0,AH41,\"\")","v":""},{"$f":"IF(K41<>0,AW41,\"\")","v":""},null,false,null,0,null,null,null,0,0,{"$f":"X41/$Z$4","v":0},{"$f":"(T41-$T$8)*2/$Z$4","v":0},{"$f":"SIN(Y41)*SIN(Z41)+COS(Y41)*COS(Z41)*COS(AA41)","v":1},0,0,{"$f":"IF(Y41<>Z41,90*(1+ABS(Y41-Z41)/(Y41-Z41)))","v":false},{"$f":"IF(AA41<>0,90+$Z$4*ATAN((SIN(Y41)*AB41-SIN(Z41))/(SIN(AA41)*COS(Y41)^2)),AE41*1)","v":0},{"$f":"IF(SIN(AA41)<0,AF41+180,AF41*1)","v":0},0,null,{"$f":"6365.11*AD41","v":0},5,null,null,{"$f":"X41/$Z$4","v":0},0,{"$f":"($T$8-T41)*2/$Z$4","v":0},{"$f":"SIN(AN41)*SIN(AO41)+COS(AN41)*COS(AO41)*COS(AP41)","v":1},0,{"$f":"IF(AC41<0,180/$Z$4+AC41,AC41)","v":0},{"$f":"IF(AN41<>AO41,90*(1+ABS(AN41-AO41)/(AN41-AO41)))","v":false},{"$f":"IF(AP41<>0,90+$Z$4*ATAN((SIN(AN41)*AQ41-SIN(AO41))/(SIN(AP41)*COS(AN41)^2)),AT41*1)","v":0},{"$f":"IF(SIN(AP41)<0,AU41+180,AU41*1)","v":0},0,null,null,null,{"$f":"M41","v":0},{"$f":"C41","v":0},{"$f":"K41","v":0}]
[null,null,null,"P",0,null,"P",0,"031",null,null,null,0,0,{"$f":"IF(K42<>0,AH42,\"\")","v":""},{"$f":"IF(K42<>0,AW42,\"\")","v":""},null,false,null,0,null,null,null,0,0,{"$f":"X42/$Z$4","v":0},{"$f":"(T42-$T$8)*2/$Z$4","v":0},{"$f":"SIN(Y42)*SIN(Z42)+COS(Y42)*COS(Z42)*COS(AA42)","v":1},0,0,{"$f":"IF(Y42<>Z42,90*(1+ABS(Y42-Z42)/(Y42-Z42)))","v":false},{"$f":"IF(AA42<>0,90+$Z$4*ATAN((SIN(Y42)*AB42-SIN(Z42))/(SIN(AA42)*COS(Y42)^2)),AE42*1)","v":0},{"$f":"IF(SIN(AA42)<0,AF42+180,AF42*1)","v":0},0,null,{"$f":"6365.11*AD42","v":0},5,null,null,{"$f":"X42/$Z$4","v":0},0,{"$f":"($T$8-T42)*2/$Z$4","v":0},{"$f":"SIN(AN42)*SIN(AO42)+COS(AN42)*COS(AO42)*COS(AP42)","v":1},0,{"$f":"IF(AC42<0,180/$Z$4+AC42,AC42)","v":0},{"$f":"IF(AN42<>AO42,90*(1+ABS(AN42-AO42)/(AN42-AO42)))","v":false},{"$f":"IF(AP42<>0,90+$Z$4*ATAN((SIN(AN42)*AQ42-SIN(AO42))/(SIN(AP42)*COS(AN42)^2)),AT42*1)","v":0},{"$f":"IF(SIN(AP42)<0,AU42+180,AU42*1)","v":0},0,null,null,null,{"$f":"M42","v":0},{"$f":"C42","v":0},{"$f":"K42","v":0}]
[null,null,null,"P",0,null,"P",0,"032",null,null,null,0,0,"","",null,false,null,0,null,null,null,0,0,0,0,1,0,0,false,0,0,0,null,0,5,null,null,0,0,0,1,0,0,false,0,0,0,null,null,null,0,0,0]
[null,null,null,"P",0,null,"P",0,"033",null,null,null,0,0,"","",null,false,null,0,null,null,null,0,0,0,0,1,0,0,false,0,0,0,null,0,5,null,null,0,0,0,1,0,0,false,0,0,0,null,null,null,0,0,0]
[null,null,null,"P",0,null,"P",0,"034",null,null,null,0,0,"","",null,false,null,0,null,null,null,0,0,0,0,1,0,0,false,0,0,0,null,0,5,null,null,0,0,0,1,0,0,false,0,0,0,null,null,null,0,0,0]
[null,null,null,"P",0,null,"P",0,"035",null,null,null,0,0,"","",null,false,null,0,null,null,null,0,0,0,0,1,0,0,false,0,0,0,null,0,5,null,null,0,0,0,1,0,0,false,0,0,0,null,null,null,0,0,0]
[null,null,null,"P",0,null,"P",0,"036",null,null,null,0,0,"","",null,false,null,0,null,null,null,0,0,0,0,1,0,0,false,0,0,0,null,0,5,null,null,0,0,0,1,0,0,false,0,0,0,null,null,null,0,0,0]
[null,null,null,"P",0,null,"P",0,"037",null,null,null,0,0,"","",null,false,null,0,null,null,null,0,0,0,0,1,0,0,false,0,0,0,null,0,5,null,null,0,0,0,1,0,0,false,0,0,0,null,null,null,0,0,0]
[null,null,null,"P",0,null,"P",0,"038",null,null,null,0,0,"","",null,false,null,0,null,null,null,0,0,0,0,1,0,0,false,0,0,0,null,0,5,null,null,0,0,0,1,0,0,false,0,0,0,null,null,null,0,0,0]
[null,null,null,"P",0,null,"P",0,"039",null,null,null,0,0,"","",null,false,null,0,null,null,null,0,0,0,0,1,0,0,false,0,0,0,null,0,5,null,null,0,0,0,1,0,0,false,0,0,0,null,null,null,0,0,0]
[null,null,null,"P",0,null,"P",0,"040",null,null,null,0,0,"","",null,false,null,0,null,null,null,0,0,0,0,1,0,0,false,0,0,0,null,0,5,null,null,0,0,0,1,0,0,false,0,0,0,null,null,null,0,0,0]
[null,null,null,"P",0,null,"P",0,"041",null,null,null,0,0,"","",null,false,null,0,null,null,null,0,0,0,0,1,0,0,false,0,0,0,null,0,5,null,null,0,0,0,1,0,0,false,0,0,0,null,null,null,0,0,0]
[null,null,null,"P",0,null,"P",0,"042",null,null,null,0,0,"","",null,false,null,0,null,null,null,0,0,0,0,1,0,0,false,0,0,0,null,0,5,null,null,0,0,0,1,0,0,false,0,0,0,null,null,null,0,0,0]
[null,null,null,"P",0,null,"P",0,"043",null,null,null,0,0,"","",null,false,null,0,null,null,null,0,0,0,0,1,0,0,false,0,0,0,null,0,5,null,null,0,0,0,1,0,0,false,0,0,0,null,null,null,0,0,0]
[null,null,null,"P",0,null,"P",0,"044",null,null,null,0,0,"","",null,false,null,0,null,null,null,0,0,0,0,1,0,0,false,0,0,0,null,0,5,null,null,0,0,0,1,0,0,false,0,0,0,null,null,null,0,0,0]
[null,null,null,"P",0,null,"P",0,"045",null,null,null,0,0,"","",null,false,null,0,null,null,null,0,0,0,0,1,0,0,false,0,0,0,null,0,5,null,null,0,0,0,1,0,0,false,0,0,0,null,null,null,0,0,0]
[null,null,null,"P",0,null,"P",0,"046",null,null,null,0,0,"","",null,false,null,0,null,null,null,0,0,0,0,1,0,0,false,0,0,0,null,0,5,null,null,0,0,0,1,0,0,false,0,0,0,null,null,null,0,0,0]
[null,null,null,"P",0,null,"P",0,"047",null,null,null,0,0,"","",null,false,null,0,null,null,null,0,0,0,0,1,0,0,false,0,0,0,null,0,5,null,null,0,0,0,1,0,0,false,0,0,0,null,null,null,0,0,0]
[null,null,null,"P",0,null,"P",0,"048",null,null,null,0,0,"","",null,false,null,0,null,null,null,0,0,0,0,1,0,0,false,0,0,0,null,0,5,null,null,0,0,0,1,0,0,false,0,0,0,null,null,null,0,0,0]
[null,null,null,"P",0,null,"P",0,"049",null,null,null,0,0,"","",null,false,null,0,null,null,null,0,0,0,0,1,0,0,false,0,0,0,null,0,5,null,null,0,0,0,1,0,0,false,0,0,0,null,null,null,0,0,0]
[null,null,null,"P",0,null,"P",0,"050",null,null,null,{"$f":"IF(K61<>\"\",AK61,0)","v":0},0,"","",null,false,null,0,null,null,null,0,0,0,0,1,0,0,false,0,0,0,null,0,5,null,null,0,0,0,1,0,0,false,0,0,0,null,null,null,0,0,0]
[null,null,null,null,null,null,null,null,null,null,null,null,null,null,null,null,null,null,null,null,null,null,null,null,null,null,null,null,null,null,null,null,null,null,null,null,null,null,null,null,null,null,null,null,null,null,null,null,null,null,null,null,null,null,null,0]

{"sheet":"23cm","index":6,"n_rows":62,"n_cols":57,"rows_kept":62,"cut":false,"hidden":false,"merged":[[7,2,7,3],[7,9,7,10],[3,6,3,8],[0,0,0,16],[7,7,7,8],[9,16,10,16],[9,1,10,1],[9,2,10,2],[9,3,10,5],[9,6,10,8],[9,9,10,9],[9,10,10,10],[9,11,10,11],[9,12,10,12],[9,13,10,13],[9,14,10,14],[9,15,10,15],[9,0,10,0],[5,2,5,7]]}
["ATV CONTEST LOG 23 cm"]
[]
[]
[null,null,null,null,null,null,null,null,null,null,null,{"$f":"IF(Summary!$V$3=1,\"Banda:\",\"Band:\")","v":"Banda:"},23,"cm",{"$f":"IF(Summary!$V$3=1,\"Analogico:\",\"Analogic\")","v":"Analogico:"},{"$f":"SUMIF($R$12:$R$61,\"=FALSO\",$N$12:$N$61)","v":0},null,null,null,null,null,null,null,null,"Deg/Rad :",{"$f":"180/PI()","v":57.295779513082323}]
[]
[{"$f":"IF(Summary!$V$3=1,\"Data:\",\"Date:\")","v":"Data:"},null,{"$f":"IF(Summary!B3=\"\",\"\",Summary!B3)","v":"2022-07-10"},null,null,null,null,null,null,null,null,{"$f":"IF(Summary!$V$3=1,\"Moltiplicatore:\",\"Multiplier:\")","v":"Moltiplicatore:"},{"$f":"Summary!$AI$41","v":2},null,{"$f":"IF(Summary!$V$3=1,\"Totale:\",\"Total:\")","v":"Totale:"},{"$f":"SUM(N12:N61)","v":0},{"$f":"IF(M4=70,1,IF(M4=24,2,IF(M4=23,2,IF(M4=13,5))))","v":2},{"$f":"IF(M4=9,\"5\",IF(M4=6,\"5\",IF(M4=3,\"5\",IF(M4=1.3,\"5\"))))","v":false},{"$f":"IF(M4=1.2,\"5\",IF(M4=0.6,\"5\",IF(M4=0.7,\"5\")))","v":false},"Longitude",null,null,null,"Latitude"]
[]
[{"$f":"IF(Summary!$V$3=1,\"Codice:\",\"Code:\")","v":"Codice:"},null,{"$f":"Summary!$B$24","v":0},null,null,null,null,{"$f":"IF(Summary!$V$3=1,\"Nominativo:\",\"Call:\")","v":"Nominativo:"},null,{"$f":"Summary!B5","v":0},null,{"$f":"IF(Summary!$V$3=1,\"Locatore WW:\",\"WW Locator:\")","v":"Locatore WW:"},{"$f":"Summary!B15","v":0},null,{"$f":"IF(Summary!$V$3=1,\"Digitale:\",\"Digital:\")","v":"Digitale:"},{"$f":"SUMIF($R$12:$R$61,\"=VERO\",$N$12:$N$61)","v":0},null,null,null,0,null,null,null,0]
[]
[{"$f":"IF(Summary!$V$3=1,\"Data\",\"Date\")","v":"Data"},{"$f":"IF(Summary!$V$3=1,\"Ora UTC\",\"Time UTC\")","v":"Ora UTC"},{"$f":"IF(Summary!$V$3=1,\"Stazioni Collegate\",\"Stations Worked\")","v":"Stazioni Collegate"},{"$f":"IF(Summary!$V$3=1,\"Rprt.+ Sequenza Ricevuta\",\"Rprt.+ Sequence Received\")","v":"Rprt.+ Sequenza Ricevuta"},null,null,{"$f":"IF(Summary!$V$3=1,\"Rpt.+ Sequenza Inviata\",\"Rpt.+ Sequence Sent\")","v":"Rpt.+ Sequenza Inviata"},null,null,{"$f":"IF(Summary!$V$3=1,\"Codice Ricevuto\",\"Code Received\")","v":"Codice Ricevuto"},{"$f":"IF(Summary!$V$3=1,\"Locatore WW\",\"WW Locator\")","v":"Locatore WW"},{"$f":"IF(Summary!$V$3=1,\"Commenti\",\"Comments\")","v":"Commenti"},{"$f":"IF(Summary!$V$3=1,\"Distanza Km\",\"Distance Km\")","v":"Distanza Km"},{"$f":"IF(Summary!$V$3=1,\"Punti\",\"Points\")","v":"Punti"},{"$f":"IF(Summary!$V$3=1,\"AZIMUT (Tuo)\",\"Heading (own)\")","v":"AZIMUT (Tuo)"},{"$f":"IF(Summary!$V$3=1,\"AZIMUT (Corrispondente)\",\"Heading (Other)\")","v":"AZIMUT (Corrispondente)"},{"$f":"IF(Summary!$V$3=1,\"DIGITALE?\",\"DIGITAL?\")","v":"DIGITALE?"},null,null,null,null,null,null,null,"Local Lat","Dist Lat","Diff Long",null,"Path Rad",null,null,null,null,null,null,null,null,null,null,"Dist Lat","Local Lat","Diff Long",null,"Path Rad",null,null,null,null,"Back"]
[null,null,null,null,null,null,null,null,null,null,null,null,null,null,null,null,null,null,null,"Longitude",null,null,null,"Latitude","A","B","L","E","D","Dcond","F1cond","F2cond","F3cond","Bearing",null,"R","Rint   km",null,null,"A","B","L","E","D","Dcond","F1cond","F2cond","F3cond","Bearing",null,null,null,"dx","call","locator","nr. QSO's","total km's"]
[null,null,null,"P",0,null,"P",0,"001",null,null,null,{"$f":"IF(K12<>\"\",AK12,0)","v":0},{"$f":"(IF(E12>1,M12,0)*$M$6/2)+(IF(H12>1,M12,0)*$M$6/2)","v":0},{"$f":"IF(K12<>0,AH12,\"\")","v":""},{"$f":"IF(K12<>0,AW12,\"\")","v":""},null,false,null,0,null,null,null,0,{"$f":"$X$8/$Z$4","v":0},{"$f":"X12/$Z$4","v":0},{"$f":"(T12-$T$8)*2/$Z$4","v":0},{"$f":"SIN(Y12)*SIN(Z12)+COS(Y12)*COS(Z12)*COS(AA12)","v":1},{"$f":"ATAN(SQRT(1-AB12*AB12)/AB12)","v":0},{"$f":"IF(AC12<0,180/$Z$4+AC12,AC12)","v":0},{"$f":"IF(Y12<>Z12,90*(1+ABS(Y12-Z12)/(Y12-Z12)))","v":false},{"$f":"IF(AA12<>0,90+$Z$4*ATAN((SIN(Y12)*AB12-SIN(Z12))/(SIN(AA12)*COS(Y12)^2)),AE12*1)","v":0},{"$f":"IF(SIN(AA12)<0,AF12+180,AF12*1)","v":0},{"$f":"INT(AG12)","v":0},null,{"$f":"6365.11*AD12","v":0},{"$f":"IF(AJ12<5,5,INT(AJ12+0.5))","v":5},null,null,{"$f":"X12/$Z$4","v":0},{"$f":"$X$8/$Z$4","v":0},{"$f":"($T$8-T12)*2/$Z$4","v":0},{"$f":"SIN(AN12)*SIN(AO12)+COS(AN12)*COS(AO12)*COS(AP12)","v":1},{"$f":"ATAN(SQRT(1-AQ12*AQ12)/AQ12)","v":0},{"$f":"IF(AC12<0,180/$Z$4+AC12,AC12)","v":0},{"$f":"IF(AN12<>AO12,90*(1+ABS(AN12-AO12)/(AN12-AO12)))","v":false},{"$f":"IF(AP12<>0,90+$Z$4*ATAN((SIN(AN12)*AQ12-SIN(AO12))/(SIN(AP12)*COS(AN12)^2)),AT12*1)","v":0},{"$f":"IF(SIN(AP12)<0,AU12+180,AU12*1)","v":0},{"$f":"INT(AV12)","v":0},null,null,null,{"$f":"M12","v":0},{"$f":"C12","v":0},{"$f":"K12","v":0},0,0]
[null,null,null,"P",0,null,"P",0,"002",null,null,null,{"$f":"IF(K13<>\"\",AK13,0)","v":0},{"$f":"(IF(E13>1,M13,0)*$M$6/2)+(IF(H13>1,M13,0)*$M$6/2)","v":0},"","",null,false,null,0,null,null,null,0,0,0,0,1,0,0,false,0,0,0,null,0,5,null,null,0,0,0,1,0,0,false,0,0,0,null,null,null,{"$f":"M13","v":0},{"$f":"C13","v":0},{"$f":"K13","v":0}]
[null,null,null,"P",0,null,"P",0,"003",null,null,null,0,0,"","",null,false,null,0,null,null,null,0,0,0,0,1,0,0,false,0,0,0,null,0,5,null,null,0,0,0,1,0,0,false,0,0,0,null,null,null,0,0,0]
[null,null,null,"P",0,null,"P",0,"004",null,null,null,0,0,"","",null,false,null,0,null,null,null,0,0,0,0,1,0,0,false,0,0,0,null,0,5,null,null,0,0,0,1,0,0,false,0,0,0,null,null,null,0,0,0]
[null,null,null,"P",0,null,"P",0,"005",null,null,null,0,0,"","",null,false,null,0,null,null,null,0,0,0,0,1,0,0,false,0,0,0,null,0,5,null,null,0,0,0,1,0,0,false,0,0,0,null,null,null,0,0,0]
[null,null,null,"P",0,null,"P",0,"006",null,null,null,0,0,"","",null,false,null,0,null,null,null,0,0,0,0,1,0,0,false,0,0,0,null,0,5,null,null,0,0,0,1,0,0,false,0,0,0,null,null,null,0,0,0]
[null,null,null,"P",0,null,"P",0,"007",null,null,null,0,0,"","",null,false,null,0,null,null,null,0,0,0,0,1,0,0,false,0,0,0,null,0,5,null,null,0,0,0,1,0,0,false,0,0,0,null,null,null,0,0,0]
[null,null,null,"P",0,null,"P",0,"008",null,null,null,0,0,"","",null,false,null,0,null,null,null,0,0,0,0,1,0,0,false,0,0,0,null,0,5,null,null,0,0,0,1,0,0,false,0,0,0,null,null,null,0,0,0]
[null,null,null,"P",0,null,"P",0,"009",null,null,null,0,0,"","",null,false,null,0,null,null,null,0,0,0,0,1,0,0,false,0,0,0,null,0,5,null,null,0,0,0,1,0,0,false,0,0,0,null,null,null,0,0,0]
[null,null,null,"P",0,null,"P",0,"010",null,null,null,0,0,"","",null,false,null,0,null,null,null,0,0,0,0,1,0,0,false,0,0,0,null,0,5,null,null,0,0,0,1,0,0,false,0,0,0,null,null,null,0,0,0]
[null,null,null,"P",0,null,"P",0,"011",null,null,null,0,0,"","",null,false,null,0,null,null,null,0,0,0,0,1,0,0,false,0,0,0,null,0,5,null,null,0,0,0,1,0,0,false,0,0,0,null,null,null,0,0,0]
[null,null,null,"P",0,null,"P",0,"012",null,null,null,0,0,"","",null,false,null,0,null,null,null,0,0,0,0,1,0,0,false,0,0,0,null,0,5,null,null,0,0,0,1,0,0,false,0,0,0,null,null,null,0,0,0]
[null,null,null,"P",0,null,"P",0,"013",null,null,null,0,0,"","",null,false,null,0,null,null,null,0,0,0,0,1,0,0,false,0,0,0,null,0,5,null,null,0,0,0,1,0,0,false,0,0,0,null,null,null,0,0,0]
[null,null,null,"P",0,null,"P",0,"014",null,null,null,0,0,"","",null,false,null,0,null,null,null,0,0,0,0,1,0,0,false,0,0,0,null,0,5,null,null,0,0,0,1,0,0,false,0,0,0,null,null,null,0,0,0]
[null,null,null,"P",0,null,"P",0,"015",null,null,null,0,0,"","",null,false,null,0,null,null,null,0,0,0,0,1,0,0,false,0,0,0,null,0,5,null,null,0,0,0,1,0,0,false,0,0,0,null,null,null,0,0,0]
[null,null,null,"P",0,null,"P",0,"016",null,null,null,0,0,"","",null,false,null,0,null,null,null,0,0,0,0,1,0,0,false,0,0,0,null,0,5,null,null,0,0,0,1,0,0,false,0,0,0,null,null,null,0,0,0]
[null,null,null,"P",0,null,"P",0,"017",null,null,null,0,0,"","",null,false,null,0,null,null,null,0,0,0,0,1,0,0,false,0,0,0,null,0,5,null,null,0,0,0,1,0,0,false,0,0,0,null,null,null,0,0,0]
[null,null,null,"P",0,null,"P",0,"018",null,null,null,0,0,"","",null,false,null,0,null,null,null,0,0,0,0,1,0,0,false,0,0,0,null,0,5,null,null,0,0,0,1,0,0,false,0,0,0,null,null,null,0,0,0]
[null,null,null,"P",0,null,"P",0,"019",null,null,null,0,0,"","",null,false,null,0,null,null,null,0,0,0,0,1,0,0,false,0,0,0,null,0,5,null,null,0,0,0,1,0,0,false,0,0,0,null,null,null,{"$f":"M30","v":0},{"$f":"C30","v":0},{"$f":"K30","v":0}]
[null,null,null,"P",0,null,"P",0,"020",null,null,null,0,0,"","",null,false,null,0,null,null,null,0,0,0,0,1,0,0,false,0,0,0,null,0,5,null,null,0,0,0,1,0,0,false,0,0,0,null,null,null,0,0,0]
[null,null,null,"P",0,null,"P",0,"021",null,null,null,0,0,"","",null,false,null,0,null,null,null,0,0,0,0,1,0,0,false,0,0,0,null,0,5,null,null,0,0,0,1,0,0,false,0,0,0,null,null,null,0,0,0]
[null,null,null,"P",0,null,"P",0,"022",null,null,null,0,0,"","",null,false,null,0,null,null,null,0,0,{"$f":"X33/$Z$4","v":0},{"$f":"(T33-$T$8)*2/$Z$4","v":0},{"$f":"SIN(Y33)*SIN(Z33)+COS(Y33)*COS(Z33)*COS(AA33)","v":1},0,0,{"$f":"IF(Y33<>Z33,90*(1+ABS(Y33-Z33)/(Y33-Z33)))","v":false},{"$f":"IF(AA33<>0,90+$Z$4*ATAN((SIN(Y33)*AB33-SIN(Z33))/(SIN(AA33)*COS(Y33)^2)),AE33*1)","v":0},{"$f":"IF(SIN(AA33)<0,AF33+180,AF33*1)","v":0},0,null,{"$f":"6365.11*AD33","v":0},5,null,null,{"$f":"X33/$Z$4","v":0},0,{"$f":"($T$8-T33)*2/$Z$4","v":0},{"$f":"SIN(AN33)*SIN(AO33)+COS(AN33)*COS(AO33)*COS(AP33)","v":1},0,{"$f":"IF(AC33<0,180/$Z$4+AC33,AC33)","v":0},{"$f":"IF(AN33<>AO33,90*(1+ABS(AN33-AO33)/(AN33-AO33)))","v":false},{"$f":"IF(AP33<>0,90+$Z$4*ATAN((SIN(AN33)*AQ33-SIN(AO33))/(SIN(AP33)*COS(AN33)^2)),AT33*1)","v":0},{"$f":"IF(SIN(AP33)<0,AU33+180,AU33*1)","v":0},0,null,null,null,0,0,0]
[null,null,null,"P",0,null,"P",0,"023",null,null,null,0,0,"","",null,false,null,0,null,null,null,0,0,0,0,1,0,0,false,0,0,0,null,0,5,null,null,0,0,0,1,0,0,false,0,0,0,null,null,null,0,0,0]
[null,null,null,"P",0,null,"P",0,"024",null,null,null,0,0,"","",null,false,null,0,null,null,null,0,0,0,0,1,0,0,false,0,0,0,null,0,5,null,null,0,0,0,1,0,0,false,0,0,0,null,null,null,0,0,0]
[null,null,null,"P",0,null,"P",0,"025",null,null,null,0,0,"","",null,false,null,0,null,null,null,0,0,0,0,1,0,0,false,0,0,0,null,0,5,null,null,0,0,0,1,0,0,false,0,0,0,null,null,null,0,0,0]
[null,null,null,"P",0,null,"P",0,"026",null,null,null,0,0,"","",null,false,null,0,null,null,null,0,0,0,0,1,0,0,false,0,0,0,null,0,5,null,null,0,0,0,1,0,0,false,0,0,0,null,null,null,0,0,0]
[null,null,null,"P",0,null,"P",0,"027",null,null,null,0,0,"","",null,false,null,0,null,null,null,0,0,0,0,1,0,0,false,0,0,0,null,0,5,null,null,0,0,0,1,0,0,false,0,0,0,null,null,null,0,0,0]
[null,null,null,"P",0,null,"P",0,"028",null,null,null,0,0,"","",null,false,null,0,null,null,null,0,0,0,0,1,0,0,false,0,0,0,null,0,5,null,null,0,0,0,1,0,0,false,0,0,0,null,null,null,0,0,0]
[null,null,null,"P",0,null,"P",0,"029",null,null,null,0,0,"","",null,false,null,0,null,null,null,0,0,0,0,1,0,0,false,0,0,0,null,0,5,null,null,0,0,0,1,0,0,false,0,0,0,null,null,null,0,0,0]
[null,null,null,"P",0,null,"P",0,"030",null,null,null,0,0,"","",null,false,null,0,null,null,null,0,0,0,0,1,0,0,false,0,0,0,null,0,5,null,null,0,0,0,1,0,0,false,0,0,0,null,null,null,0,0,0]
[null,null,null,"P",0,null,"P",0,"031",null,null,null,0,0,"","",null,false,null,0,null,null,null,0,0,0,0,1,0,0,false,0,0,0,null,0,5,null,null,0,0,0,1,0,0,false,0,0,0,null,null,null,0,0,0]
[null,null,null,"P",0,null,"P",0,"032",null,null,null,0,0,"","",null,false,null,0,null,null,null,0,0,0,0,1,0,0,false,0,0,0,null,0,5,null,null,0,0,0,1,0,0,false,0,0,0,null,null,null,0,0,0]
[null,null,null,"P",0,null,"P",0,"033",null,null,null,0,0,"","",null,false,null,0,null,null,null,0,0,0,0,1,0,0,false,0,0,0,null,0,5,null,null,0,0,0,1,0,0,false,0,0,0,null,null,null,0,0,0]
[null,null,null,"P",0,null,"P",0,"034",null,null,null,0,0,"","",null,false,null,0,null,null,null,0,0,0,0,1,0,0,false,0,0,0,null,0,5,null,null,0,0,0,1,0,0,false,0,0,0,null,null,null,0,0,0]
[null,null,null,"P",0,null,"P",0,"035",null,null,null,0,0,"","",null,false,null,0,null,null,null,0,0,0,0,1,0,0,false,0,0,0,null,0,5,null,null,0,0,0,1,0,0,false,0,0,0,null,null,null,0,0,0]
[null,null,null,"P",0,null,"P",0,"036",null,null,null,0,0,"","",null,false,null,0,null,null,null,0,0,0,0,1,0,0,false,0,0,0,null,0,5,null,null,0,0,0,1,0,0,false,0,0,0,null,null,null,0,0,0]
[null,null,null,"P",0,null,"P",0,"037",null,null,null,0,0,"","",null,false,null,0,null,null,null,0,0,0,0,1,0,0,false,0,0,0,null,0,5,null,null,0,0,0,1,0,0,false,0,0,0,null,null,null,0,0,0]
[null,null,null,"P",0,null,"P",0,"038",null,null,null,0,0,"","",null,false,null,0,null,null,null,0,0,0,0,1,0,0,false,0,0,0,null,0,5,null,null,0,0,0,1,0,0,false,0,0,0,null,null,null,0,0,0]
[null,null,null,"P",0,null,"P",0,"039",null,null,null,0,0,"","",null,false,null,0,null,null,null,0,0,0,0,1,0,0,false,0,0,0,null,0,5,null,null,0,0,0,1,0,0,false,0,0,0,null,null,null,0,0,0]
[null,null,null,"P",0,null,"P",0,"040",null,null,null,0,0,"","",null,false,null,0,null,null,null,0,0,0,0,1,0,0,false,0,0,0,null,0,5,null,null,0,0,0,1,0,0,false,0,0,0,null,null,null,0,0,0]
[null,null,null,"P",0,null,"P",0,"041",null,null,null,0,0,"","",null,false,null,0,null,null,null,0,{"$f":"$X$8/$Z$4","v":0},{"$f":"X52/$Z$4","v":0},{"$f":"(T52-$T$8)*2/$Z$4","v":0},{"$f":"SIN(Y52)*SIN(Z52)+COS(Y52)*COS(Z52)*COS(AA52)","v":1},{"$f":"ATAN(SQRT(1-AB52*AB52)/AB52)","v":0},{"$f":"IF(AC52<0,180/$Z$4+AC52,AC52)","v":0},{"$f":"IF(Y52<>Z52,90*(1+ABS(Y52-Z52)/(Y52-Z52)))","v":false},{"$f":"IF(AA52<>0,90+$Z$4*ATAN((SIN(Y52)*AB52-SIN(Z52))/(SIN(AA52)*COS(Y52)^2)),AE52*1)","v":0},{"$f":"IF(SIN(AA52)<0,AF52+180,AF52*1)","v":0},{"$f":"INT(AG52)","v":0},null,{"$f":"6365.11*AD52","v":0},{"$f":"IF(AJ52<5,5,INT(AJ52+0.5))","v":5},null,null,{"$f":"X52/$Z$4","v":0},{"$f":"$X$8/$Z$4","v":0},{"$f":"($T$8-T52)*2/$Z$4","v":0},{"$f":"SIN(AN52)*SIN(AO52)+COS(AN52)*COS(AO52)*COS(AP52)","v":1},{"$f":"ATAN(SQRT(1-AQ52*AQ52)/AQ52)","v":0},{"$f":"IF(AC52<0,180/$Z$4+AC52,AC52)","v":0},{"$f":"IF(AN52<>AO52,90*(1+ABS(AN52-AO52)/(AN52-AO52)))","v":false},{"$f":"IF(AP52<>0,90+$Z$4*ATAN((SIN(AN52)*AQ52-SIN(AO52))/(SIN(AP52)*COS(AN52)^2)),AT52*1)","v":0},{"$f":"IF(SIN(AP52)<0,AU52+180,AU52*1)","v":0},{"$f":"INT(AV52)","v":0},null,null,null,{"$f":"M52","v":0},{"$f":"C52","v":0},{"$f":"K52","v":0}]
[null,null,null,"P",0,null,"P",0,"042",null,null,null,0,0,"","",null,false,null,0,null,null,null,0,0,0,0,1,0,0,false,0,0,0,null,0,5,null,null,0,0,0,1,0,0,false,0,0,0,null,null,null,0,0,0]
[null,null,null,"P",0,null,"P",0,"043",null,null,null,0,0,"","",null,false,null,0,null,null,null,0,0,0,0,1,0,0,false,0,0,0,null,0,5,null,null,0,0,0,1,0,0,false,0,0,0,null,null,null,0,0,0]
[null,null,null,"P",0,null,"P",0,"044",null,null,null,0,0,"","",null,false,null,0,null,null,null,0,0,0,0,1,0,0,false,0,0,0,null,0,5,null,null,0,0,0,1,0,0,false,0,0,0,null,null,null,0,0,0]
[null,null,null,"P",0,null,"P",0,"045",null,null,null,0,0,"","",null,false,null,0,null,null,null,0,0,0,0,1,0,0,false,0,0,0,null,0,5,null,null,0,0,0,1,0,0,false,0,0,0,null,null,null,0,0,0]
[null,null,null,"P",0,null,"P",0,"046",null,null,null,0,0,"","",null,false,null,0,null,null,null,0,0,0,0,1,0,0,false,0,0,0,null,0,5,null,null,0,0,0,1,0,0,false,0,0,0,null,null,null,0,0,0]
[null,null,null,"P",0,null,"P",0,"047",null,null,null,0,0,"","",null,false,null,0,null,null,null,0,0,0,0,1,0,0,false,0,0,0,null,0,5,null,null,0,0,0,1,0,0,false,0,0,0,null,null,null,0,0,0]
[null,null,null,"P",0,null,"P",0,"048",null,null,null,0,0,"","",null,false,null,0,null,null,null,0,0,0,0,1,0,0,false,0,0,0,null,0,5,null,null,0,0,0,1,0,0,false,0,0,0,null,null,null,0,0,0]
[null,null,null,"P",0,null,"P",0,"049",null,null,null,0,0,"","",null,false,null,0,null,null,null,0,0,0,0,1,0,0,false,0,0,0,null,0,5,null,null,0,0,0,1,0,0,false,0,0,0,null,null,null,0,0,0]
[null,null,null,"P",0,null,"P",0,"050",null,null,null,0,0,"","",null,false,null,0,null,null,null,0,0,0,0,1,0,0,false,0,0,0,null,0,5,null,null,0,0,0,1,0,0,false,0,0,0,null,null,null,0,0,0]
[null,null,null,null,null,null,null,null,null,null,null,null,null,null,null,null,null,null,null,null,null,null,null,null,null,null,null,null,null,null,null,null,null,null,null,null,null,null,null,null,null,null,null,null,null,null,null,null,null,null,null,null,null,null,null,0]

{"sheet":"13cm","index":7,"n_rows":62,"n_cols":57,"rows_kept":62,"cut":false,"hidden":false,"merged":[[7,2,7,3],[7,9,7,10],[3,6,3,8],[0,0,0,16],[7,7,7,8],[9,16,10,16],[9,1,10,1],[9,2,10,2],[9,3,10,5],[9,6,10,8],[9,9,10,9],[9,10,10,10],[9,11,10,11],[9,12,10,12],[9,13,10,13],[9,14,10,14],[9,15,10,15],[9,0,10,0],[5,2,5,7]]}
["ATV CONTEST LOG 13 cm"]
[]
[]
[null,null,null,null,null,null,null,null,null,null,null,{"$f":"IF(Summary!$V$3=1,\"Banda:\",\"Band:\")","v":"Banda:"},13,"cm",{"$f":"IF(Summary!$V$3=1,\"Analogico:\",\"Analogic\")","v":"Analogico:"},{"$f":"SUMIF($R$12:$R$61,\"=FALSO\",$N$12:$N$61)","v":0},null,null,null,null,null,null,null,null,"Deg/Rad :",{"$f":"180/PI()","v":57.295779513082323}]
[]
[{"$f":"IF(Summary!$V$3=1,\"Data:\",\"Date:\")","v":"Data:"},null,{"$f":"IF(Summary!B3=\"\",\"\",Summary!B3)","v":"2022-07-10"},null,null,null,null,null,null,null,null,{"$f":"IF(Summary!$V$3=1,\"Moltiplicatore:\",\"Multiplier:\")","v":"Moltiplicatore:"},{"$f":"Summary!AI42","v":4},null,{"$f":"IF(Summary!$V$3=1,\"Totale:\",\"Total:\")","v":"Totale:"},{"$f":"SUM(N12:N61)","v":0},{"$f":"IF(M4=70,1,IF(M4=24,2,IF(M4=23,2,IF(M4=13,5))))","v":5},{"$f":"IF(M4=9,\"5\",IF(M4=6,\"5\",IF(M4=3,\"5\",IF(M4=1.3,\"5\"))))","v":false},{"$f":"IF(M4=1.2,\"5\",IF(M4=0.6,\"5\",IF(M4=0.7,\"5\")))","v":false},"Longitude",null,null,null,"Latitude"]
[]
[{"$f":"IF(Summary!$V$3=1,\"Codice:\",\"Code:\")","v":"Codice:"},null,{"$f":"Summary!$B$25","v":0},null,null,null,null,{"$f":"IF(Summary!$V$3=1,\"Nominativo:\",\"Call:\")","v":"Nominativo:"},null,{"$f":"Summary!B5","v":0},null,{"$f":"IF(Summary!$V$3=1,\"Locatore WW:\",\"WW Locator:\")","v":"Locatore WW:"},{"$f":"Summary!B15","v":0},null,{"$f":"IF(Summary!$V$3=1,\"Digitale:\",\"Digital:\")","v":"Digitale:"},{"$f":"SUMIF($R$12:$R$61,\"=VERO\",$N$12:$N$61)","v":0},null,null,null,0,null,null,null,0]
[]
[{"$f":"IF(Summary!$V$3=1,\"Data\",\"Date\")","v":"Data"},{"$f":"IF(Summary!$V$3=1,\"Ora UTC\",\"Time UTC\")","v":"Ora UTC"},{"$f":"IF(Summary!$V$3=1,\"Stazioni Collegate\",\"Stations Worked\")","v":"Stazioni Collegate"},{"$f":"IF(Summary!$V$3=1,\"Rprt.+ Sequenza Ricevuta\",\"Rprt.+ Sequence Received\")","v":"Rprt.+ Sequenza Ricevuta"},null,null,{"$f":"IF(Summary!$V$3=1,\"Rpt.+ Sequenza Inviata\",\"Rpt.+ Sequence Sent\")","v":"Rpt.+ Sequenza Inviata"},null,null,{"$f":"IF(Summary!$V$3=1,\"Codice Ricevuto\",\"Code Received\")","v":"Codice Ricevuto"},{"$f":"IF(Summary!$V$3=1,\"Locatore WW\",\"WW Locator\")","v":"Locatore WW"},{"$f":"IF(Summary!$V$3=1,\"Commenti\",\"Comments\")","v":"Commenti"},{"$f":"IF(Summary!$V$3=1,\"Distanza Km\",\"Distance Km\")","v":"Distanza Km"},{"$f":"IF(Summary!$V$3=1,\"Punti\",\"Points\")","v":"Punti"},{"$f":"IF(Summary!$V$3=1,\"AZIMUT (Tuo)\",\"Heading (own)\")","v":"AZIMUT (Tuo)"},{"$f":"IF(Summary!$V$3=1,\"AZIMUT (Corrispondente)\",\"Heading (Other)\")","v":"AZIMUT (Corrispondente)"},{"$f":"IF(Summary!$V$3=1,\"DIGITALE?\",\"DIGITAL?\")","v":"DIGITALE?"},null,null,null,null,null,null,null,"Local Lat","Dist Lat","Diff Long",null,"Path Rad",null,null,null,null,null,null,null,null,null,null,"Dist Lat","Local Lat","Diff Long",null,"Path Rad",null,null,null,null,"Back"]
[null,null,null,null,null,null,null,null,null,null,null,null,null,null,null,null,null,null,null,"Longitude",null,null,null,"Latitude","A","B","L","E","D","Dcond","F1cond","F2cond","F3cond","Bearing",null,"R","Rint   km",null,null,"A","B","L","E","D","Dcond","F1cond","F2cond","F3cond","Bearing",null,null,null,"dx","call","locator","nr. QSO's","total km's"]
[null,null,null,"P",0,null,"P",0,"001",null,null,null,{"$f":"IF(K12<>\"\",AK12,0)","v":0},{"$f":"(IF(E12>1,M12,0)*$M$6/2)+(IF(H12>1,M12,0)*$M$6/2)","v":0},{"$f":"IF(K12<>0,AH12,\"\")","v":""},{"$f":"IF(K12<>0,AW12,\"\")","v":""},null,false,null,0,null,null,null,0,{"$f":"$X$8/$Z$4","v":0},{"$f":"X12/$Z$4","v":0},{"$f":"(T12-$T$8)*2/$Z$4","v":0},{"$f":"SIN(Y12)*SIN(Z12)+COS(Y12)*COS(Z12)*COS(AA12)","v":1},{"$f":"ATAN(SQRT(1-AB12*AB12)/AB12)","v":0},{"$f":"IF(AC12<0,180/$Z$4+AC12,AC12)","v":0},{"$f":"IF(Y12<>Z12,90*(1+ABS(Y12-Z12)/(Y12-Z12)))","v":false},{"$f":"IF(AA12<>0,90+$Z$4*ATAN((SIN(Y12)*AB12-SIN(Z12))/(SIN(AA12)*COS(Y12)^2)),AE12*1)","v":0},{"$f":"IF(SIN(AA12)<0,AF12+180,AF12*1)","v":0},{"$f":"INT(AG12)","v":0},null,{"$f":"6365.11*AD12","v":0},{"$f":"IF(AJ12<5,5,INT(AJ12+0.5))","v":5},null,null,{"$f":"X12/$Z$4","v":0},{"$f":"$X$8/$Z$4","v":0},{"$f":"($T$8-T12)*2/$Z$4","v":0},{"$f":"SIN(AN12)*SIN(AO12)+COS(AN12)*COS(AO12)*COS(AP12)","v":1},{"$f":"ATAN(SQRT(1-AQ12*AQ12)/AQ12)","v":0},{"$f":"IF(AC12<0,180/$Z$4+AC12,AC12)","v":0},{"$f":"IF(AN12<>AO12,90*(1+ABS(AN12-AO12)/(AN12-AO12)))","v":false},{"$f":"IF(AP12<>0,90+$Z$4*ATAN((SIN(AN12)*AQ12-SIN(AO12))/(SIN(AP12)*COS(AN12)^2)),AT12*1)","v":0},{"$f":"IF(SIN(AP12)<0,AU12+180,AU12*1)","v":0},{"$f":"INT(AV12)","v":0},null,null,null,{"$f":"M12","v":0},{"$f":"C12","v":0},{"$f":"K12","v":0},0,0]
[null,null,null,"P",0,null,"P",0,"002",null,null,null,{"$f":"IF(K13<>\"\",AK13,0)","v":0},{"$f":"(IF(E13>1,M13,0)*$M$6/2)+(IF(H13>1,M13,0)*$M$6/2)","v":0},"","",null,false,null,0,null,null,null,0,0,0,0,1,0,0,false,0,0,0,null,0,5,null,null,0,0,0,1,0,0,false,0,0,0,null,null,null,{"$f":"M13","v":0},{"$f":"C13","v":0},{"$f":"K13","v":0}]
[null,null,null,"P",0,null,"P",0,"003",null,null,null,0,0,"","",null,false,null,0,null,null,null,0,0,0,0,1,0,0,false,0,0,0,null,0,5,null,null,0,0,0,1,0,0,false,0,0,0,null,null,null,0,0,0]
[null,null,null,"P",0,null,"P",0,"004",null,null,null,0,0,"","",null,false,null,0,null,null,null,0,0,0,0,1,0,0,false,0,0,0,null,0,5,null,null,0,0,0,1,0,0,false,0,0,0,null,null,null,0,0,0]
[null,null,null,"P",0,null,"P",0,"005",null,null,null,0,0,"","",null,false,null,0,null,null,null,0,0,0,0,1,0,0,false,0,0,0,null,0,5,null,null,0,0,0,1,0,0,false,0,0,0,null,null,null,0,0,0]
[null,null,null,"P",0,null,"P",0,"006",null,null,null,0,0,"","",null,false,null,0,null,null,null,0,0,0,0,1,0,0,false,0,0,0,null,0,5,null,null,0,0,0,1,0,0,false,0,0,0,null,null,null,0,0,0]
[null,null,null,"P",0,null,"P",0,"007",null,null,null,0,0,"","",null,false,null,0,null,null,null,0,0,0,0,1,0,0,false,0,0,0,null,0,5,null,null,0,0,0,1,0,0,false,0,0,0,null,null,null,0,0,0]
[null,null,null,"P",0,null,"P",0,"008",null,null,null,0,0,"","",null,false,null,0,null,null,null,0,0,0,0,1,0,0,false,0,0,0,null,0,5,null,null,0,0,0,1,0,0,false,0,0,0,null,null,null,0,0,0]
[null,null,null,"P",0,null,"P",0,"009",null,null,null,0,0,"","",null,false,null,0,null,null,null,0,0,0,0,1,0,0,false,0,0,0,null,0,5,null,null,0,0,0,1,0,0,false,0,0,0,null,null,null,0,0,0]
[null,null,null,"P",0,null,"P",0,"010",null,null,null,0,0,"","",null,false,null,0,null,null,null,0,0,0,0,1,0,0,false,0,0,0,null,0,5,null,null,0,0,0,1,0,0,false,0,0,0,null,null,null,0,0,0]
[null,null,null,"P",0,null,"P",0,"011",null,null,null,0,0,"","",null,false,null,0,null,null,null,0,0,0,0,1,0,0,false,0,0,0,null,0,5,null,null,0,0,0,1,0,0,false,0,0,0,null,null,null,0,0,0]
[null,null,null,"P",0,null,"P",0,"012",null,null,null,0,0,"","",null,false,null,0,null,null,null,0,0,0,0,1,0,0,false,0,0,0,null,0,5,null,null,0,0,0,1,0,0,false,0,0,0,null,null,null,0,0,0]
[null,null,null,"P",0,null,"P",0,"013",null,null,null,0,0,"","",null,false,null,0,null,null,null,0,0,0,0,1,0,0,false,0,0,0,null,0,5,null,null,0,0,0,1,0,0,false,0,0,0,null,null,null,0,0,0]
[null,null,null,"P",0,null,"P",0,"014",null,null,null,0,0,"","",null,false,null,0,null,null,null,0,0,0,0,1,0,0,false,0,0,0,null,0,5,null,null,0,0,0,1,0,0,false,0,0,0,null,null,null,0,0,0]
[null,null,null,"P",0,null,"P",0,"015",null,null,null,0,0,"","",null,false,null,0,null,null,null,0,0,0,0,1,0,0,false,0,0,0,null,0,5,null,null,0,0,0,1,0,0,false,0,0,0,null,null,null,0,0,0]
[null,null,null,"P",0,null,"P",0,"016",null,null,null,0,0,"","",null,false,null,0,null,null,null,0,0,0,0,1,0,0,false,0,0,0,null,0,5,null,null,0,0,0,1,0,0,false,0,0,0,null,null,null,0,0,0]
[null,null,null,"P",0,null,"P",0,"017",null,null,null,0,0,"","",null,false,null,0,null,null,null,0,0,0,0,1,0,0,false,0,0,0,null,0,5,null,null,0,0,0,1,0,0,false,0,0,0,null,null,null,0,0,0]
[null,null,null,"P",0,null,"P",0,"018",null,null,null,0,0,"","",null,false,null,0,null,null,null,0,0,0,0,1,0,0,false,0,0,0,null,0,5,null,null,0,0,0,1,0,0,false,0,0,0,null,null,null,0,0,0]
[null,null,null,"P",0,null,"P",0,"019",null,null,null,0,0,"","",null,false,null,0,null,null,null,0,0,0,0,1,0,0,false,0,0,0,null,0,5,null,null,0,0,0,1,0,0,false,0,0,0,null,null,null,0,0,0]
[null,null,null,"P",0,null,"P",0,"020",null,null,null,0,0,"","",null,false,null,0,null,null,null,0,0,0,0,1,0,0,false,0,0,0,null,0,5,null,null,0,0,0,1,0,0,false,0,0,0,null,null,null,0,0,0]
[null,null,null,"P",0,null,"P",0,"021",null,null,null,0,0,"","",null,false,null,0,null,null,null,0,0,0,0,1,0,0,false,0,0,0,null,0,5,null,null,0,0,0,1,0,0,false,0,0,0,null,null,null,0,0,0]
[null,null,null,"P",0,null,"P",0,"022",null,null,null,0,0,"","",null,false,null,0,null,null,null,0,0,0,0,1,0,0,false,0,0,0,null,0,5,null,null,0,0,0,1,0,0,false,0,0,0,null,null,null,0,0,0]
[null,null,null,"P",0,null,"P",0,"023",null,null,null,0,0,"","",null,false,null,0,null,null,null,0,0,0,0,1,0,0,false,0,0,0,null,0,5,null,null,0,0,0,1,0,0,false,0,0,0,null,null,null,0,0,0]
[null,null,null,"P",0,null,"P",0,"024",null,null,null,0,0,"","",null,false,null,0,null,null,null,0,0,{"$f":"X35/$Z$4","v":0},{"$f":"(T35-$T$8)*2/$Z$4","v":0},{"$f":"SIN(Y35)*SIN(Z35)+COS(Y35)*COS(Z35)*COS(AA35)","v":1},0,0,{"$f":"IF(Y35<>Z35,90*(1+ABS(Y35-Z35)/(Y35-Z35)))","v":false},{"$f":"IF(AA35<>0,90+$Z$4*ATAN((SIN(Y35)*AB35-SIN(Z35))/(SIN(AA35)*COS(Y35)^2)),AE35*1)","v":0},{"$f":"IF(SIN(AA35)<0,AF35+180,AF35*1)","v":0},0,null,{"$f":"6365.11*AD35","v":0},5,null,null,{"$f":"X35/$Z$4","v":0},0,{"$f":"($T$8-T35)*2/$Z$4","v":0},{"$f":"SIN(AN35)*SIN(AO35)+COS(AN35)*COS(AO35)*COS(AP35)","v":1},0,{"$f":"IF(AC35<0,180/$Z$4+AC35,AC35)","v":0},{"$f":"IF(AN35<>AO35,90*(1+ABS(AN35-AO35)/(AN35-AO35)))","v":false},{"$f":"IF(AP35<>0,90+$Z$4*ATAN((SIN(AN35)*AQ35-SIN(AO35))/(SIN(AP35)*COS(AN35)^2)),AT35*1)","v":0},{"$f":"IF(SIN(AP35)<0,AU35+180,AU35*1)","v":0},0,null,null,null,0,0,0]
[null,null,null,"P",0,null,"P",0,"025",null,null,null,0,0,"","",null,false,null,0,null,null,null,0,0,{"$f":"X36/$Z$4","v":0},{"$f":"(T36-$T$8)*2/$Z$4","v":0},{"$f":"SIN(Y36)*SIN(Z36)+COS(Y36)*COS(Z36)*COS(AA36)","v":1},0,0,{"$f":"IF(Y36<>Z36,90*(1+ABS(Y36-Z36)/(Y36-Z36)))","v":false},{"$f":"IF(AA36<>0,90+$Z$4*ATAN((SIN(Y36)*AB36-SIN(Z36))/(SIN(AA36)*COS(Y36)^2)),AE36*1)","v":0},{"$f":"IF(SIN(AA36)<0,AF36+180,AF36*1)","v":0},0,null,{"$f":"6365.11*AD36","v":0},5,null,null,{"$f":"X36/$Z$4","v":0},0,{"$f":"($T$8-T36)*2/$Z$4","v":0},{"$f":"SIN(AN36)*SIN(AO36)+COS(AN36)*COS(AO36)*COS(AP36)","v":1},0,{"$f":"IF(AC36<0,180/$Z$4+AC36,AC36)","v":0},{"$f":"IF(AN36<>AO36,90*(1+ABS(AN36-AO36)/(AN36-AO36)))","v":false},{"$f":"IF(AP36<>0,90+$Z$4*ATAN((SIN(AN36)*AQ36-SIN(AO36))/(SIN(AP36)*COS(AN36)^2)),AT36*1)","v":0},{"$f":"IF(SIN(AP36)<0,AU36+180,AU36*1)","v":0},0,null,null,null,0,0,0]
[null,null,null,"P",0,null,"P",0,"026",null,null,null,0,0,"","",null,false,null,0,null,null,null,0,0,{"$f":"X37/$Z$4","v":0},{"$f":"(T37-$T$8)*2/$Z$4","v":0},{"$f":"SIN(Y37)*SIN(Z37)+COS(Y37)*COS(Z37)*COS(AA37)","v":1},0,0,{"$f":"IF(Y37<>Z37,90*(1+ABS(Y37-Z37)/(Y37-Z37)))","v":false},{"$f":"IF(AA37<>0,90+$Z$4*ATAN((SIN(Y37)*AB37-SIN(Z37))/(SIN(AA37)*COS(Y37)^2)),AE37*1)","v":0},{"$f":"IF(SIN(AA37)<0,AF37+180,AF37*1)","v":0},0,null,{"$f":"6365.11*AD37","v":0},5,null,null,{"$f":"X37/$Z$4","v":0},0,{"$f":"($T$8-T37)*2/$Z$4","v":0},{"$f":"SIN(AN37)*SIN(AO37)+COS(AN37)*COS(AO37)*COS(AP37)","v":1},0,{"$f":"IF(AC37<0,180/$Z$4+AC37,AC37)","v":0},{"$f":"IF(AN37<>AO37,90*(1+ABS(AN37-AO37)/(AN37-AO37)))","v":false},{"$f":"IF(AP37<>0,90+$Z$4*ATAN((SIN(AN37)*AQ37-SIN(AO37))/(SIN(AP37)*COS(AN37)^2)),AT37*1)","v":0},{"$f":"IF(SIN(AP37)<0,AU37+180,AU37*1)","v":0},0,null,null,null,0,0,0]
[null,null,null,"P",0,null,"P",0,"027",null,null,null,0,0,"","",null,false,null,0,null,null,null,0,0,{"$f":"X38/$Z$4","v":0},{"$f":"(T38-$T$8)*2/$Z$4","v":0},{"$f":"SIN(Y38)*SIN(Z38)+COS(Y38)*COS(Z38)*COS(AA38)","v":1},0,0,{"$f":"IF(Y38<>Z38,90*(1+ABS(Y38-Z38)/(Y38-Z38)))","v":false},{"$f":"IF(AA38<>0,90+$Z$4*ATAN((SIN(Y38)*AB38-SIN(Z38))/(SIN(AA38)*COS(Y38)^2)),AE38*1)","v":0},{"$f":"IF(SIN(AA38)<0,AF38+180,AF38*1)","v":0},0,null,{"$f":"6365.11*AD38","v":0},5,null,null,{"$f":"X38/$Z$4","v":0},0,{"$f":"($T$8-T38)*2/$Z$4","v":0},{"$f":"SIN(AN38)*SIN(AO38)+COS(AN38)*COS(AO38)*COS(AP38)","v":1},0,{"$f":"IF(AC38<0,180/$Z$4+AC38,AC38)","v":0},{"$f":"IF(AN38<>AO38,90*(1+ABS(AN38-AO38)/(AN38-AO38)))","v":false},{"$f":"IF(AP38<>0,90+$Z$4*ATAN((SIN(AN38)*AQ38-SIN(AO38))/(SIN(AP38)*COS(AN38)^2)),AT38*1)","v":0},{"$f":"IF(SIN(AP38)<0,AU38+180,AU38*1)","v":0},0,null,null,null,0,0,0]
[null,null,null,"P",0,null,"P",0,"028",null,null,null,0,0,"","",null,false,null,0,null,null,null,0,0,{"$f":"X39/$Z$4","v":0},{"$f":"(T39-$T$8)*2/$Z$4","v":0},{"$f":"SIN(Y39)*SIN(Z39)+COS(Y39)*COS(Z39)*COS(AA39)","v":1},0,0,{"$f":"IF(Y39<>Z39,90*(1+ABS(Y39-Z39)/(Y39-Z39)))","v":false},{"$f":"IF(AA39<>0,90+$Z$4*ATAN((SIN(Y39)*AB39-SIN(Z39))/(SIN(AA39)*COS(Y39)^2)),AE39*1)","v":0},{"$f":"IF(SIN(AA39)<0,AF39+180,AF39*1)","v":0},0,null,{"$f":"6365.11*AD39","v":0},5,null,null,{"$f":"X39/$Z$4","v":0},0,{"$f":"($T$8-T39)*2/$Z$4","v":0},{"$f":"SIN(AN39)*SIN(AO39)+COS(AN39)*COS(AO39)*COS(AP39)","v":1},0,{"$f":"IF(AC39<0,180/$Z$4+AC39,AC39)","v":0},{"$f":"IF(AN39<>AO39,90*(1+ABS(AN39-AO39)/(AN39-AO39)))","v":false},{"$f":"IF(AP39<>0,90+$Z$4*ATAN((SIN(AN39)*AQ39-SIN(AO39))/(SIN(AP39)*COS(AN39)^2)),AT39*1)","v":0},{"$f":"IF(SIN(AP39)<0,AU39+180,AU39*1)","v":0},0,null,null,null,0,0,0]
[null,null,null,"P",0,null,"P",0,"029",null,null,null,0,0,"","",null,false,null,0,null,null,null,0,0,0,0,1,0,0,false,0,0,0,null,0,5,null,null,0,0,0,1,0,0,false,0,0,0,null,null,null,0,0,0]
[null,null,null,"P",0,null,"P",0,"030",null,null,null,0,0,"","",null,false,null,0,null,null,null,0,{"$f":"$X$8/$Z$4","v":0},{"$f":"X41/$Z$4","v":0},{"$f":"(T41-$T$8)*2/$Z$4","v":0},{"$f":"SIN(Y41)*SIN(Z41)+COS(Y41)*COS(Z41)*COS(AA41)","v":1},{"$f":"ATAN(SQRT(1-AB41*AB41)/AB41)","v":0},{"$f":"IF(AC41<0,180/$Z$4+AC41,AC41)","v":0},{"$f":"IF(Y41<>Z41,90*(1+ABS(Y41-Z41)/(Y41-Z41)))","v":false},{"$f":"IF(AA41<>0,90+$Z$4*ATAN((SIN(Y41)*AB41-SIN(Z41))/(SIN(AA41)*COS(Y41)^2)),AE41*1)","v":0},{"$f":"IF(SIN(AA41)<0,AF41+180,AF41*1)","v":0},{"$f":"INT(AG41)","v":0},null,{"$f":"6365.11*AD41","v":0},{"$f":"IF(AJ41<5,5,INT(AJ41+0.5))","v":5},null,null,{"$f":"X41/$Z$4","v":0},{"$f":"$X$8/$Z$4","v":0},{"$f":"($T$8-T41)*2/$Z$4","v":0},{"$f":"SIN(AN41)*SIN(AO41)+COS(AN41)*COS(AO41)*COS(AP41)","v":1},{"$f":"ATAN(SQRT(1-AQ41*AQ41)/AQ41)","v":0},{"$f":"IF(AC41<0,180/$Z$4+AC41,AC41)","v":0},{"$f":"IF(AN41<>AO41,90*(1+ABS(AN41-AO41)/(AN41-AO41)))","v":false},{"$f":"IF(AP41<>0,90+$Z$4*ATAN((SIN(AN41)*AQ41-SIN(AO41))/(SIN(AP41)*COS(AN41)^2)),AT41*1)","v":0},{"$f":"IF(SIN(AP41)<0,AU41+180,AU41*1)","v":0},{"$f":"INT(AV41)","v":0},null,null,null,{"$f":"M41","v":0},{"$f":"C41","v":0},{"$f":"K41","v":0}]
[null,null,null,"P",0,null,"P",0,"031",null,null,null,0,0,"","",null,false,null,0,null,null,null,0,0,0,0,1,0,0,false,0,0,0,null,0,5,null,null,0,0,0,1,0,0,false,0,0,0,null,null,null,0,0,0]
[null,null,null,"P",0,null,"P",0,"032",null,null,null,0,0,"","",null,false,null,0,null,null,null,0,0,0,0,1,0,0,false,0,0,0,null,0,5,null,null,0,0,0,1,0,0,false,0,0,0,null,null,null,0,0,0]
[null,null,null,"P",0,null,"P",0,"033",null,null,null,0,0,"","",null,false,null,0,null,null,null,0,0,0,0,1,0,0,false,0,0,0,null,0,5,null,null,0,0,0,1,0,0,false,0,0,0,null,null,null,0,0,0]
[null,null,null,"P",0,null,"P",0,"034",null,null,null,0,0,"","",null,false,null,0,null,null,null,0,0,0,0,1,0,0,false,0,0,0,null,0,5,null,null,0,0,0,1,0,0,false,0,0,0,null,null,null,0,0,0]
[null,null,null,"P",0,null,"P",0,"035",null,null,null,0,0,"","",null,false,null,0,null,null,null,0,0,0,0,1,0,0,false,0,0,0,null,0,5,null,null,0,0,0,1,0,0,false,0,0,0,null,null,null,0,0,0]
[null,null,null,"P",0,null,"P",0,"036",null,null,null,0,0,"","",null,false,null,0,null,null,null,0,0,0,0,1,0,0,false,0,0,0,null,0,5,null,null,0,0,0,1,0,0,false,0,0,0,null,null,null,0,0,0]
[null,null,null,"P",0,null,"P",0,"037",null,null,null,0,0,"","",null,false,null,0,null,null,null,0,0,0,0,1,0,0,false,0,0,0,null,0,5,null,null,0,0,0,1,0,0,false,0,0,0,null,null,null,0,0,0]
[null,null,null,"P",0,null,"P",0,"038",null,null,null,0,0,"","",null,false,null,0,null,null,null,0,0,0,0,1,0,0,false,0,0,0,null,0,5,null,null,0,0,0,1,0,0,false,0,0,0,null,null,null,0,0,0]
[null,null,null,"P",0,null,"P",0,"039",null,null,null,0,0,"","",null,false,null,0,null,null,null,0,0,0,0,1,0,0,false,0,0,0,null,0,5,null,null,0,0,0,1,0,0,false,0,0,0,null,null,null,0,0,0]
[null,null,null,"P",0,null,"P",0,"040",null,null,null,0,0,"","",null,false,null,0,null,null,null,0,0,0,0,1,0,0,false,0,0,0,null,0,5,null,null,0,0,0,1,0,0,false,0,0,0,null,null,null,0,0,0]
[null,null,null,"P",0,null,"P",0,"041",null,null,null,0,0,"","",null,false,null,0,null,null,null,0,0,0,0,1,0,0,false,0,0,0,null,0,5,null,null,0,0,0,1,0,0,false,0,0,0,null,null,null,0,0,0]
[null,null,null,"P",0,null,"P",0,"042",null,null,null,0,0,"","",null,false,null,0,null,null,null,0,0,0,0,1,0,0,false,0,0,0,null,0,5,null,null,0,0,0,1,0,0,false,0,0,0,null,null,null,0,0,0]
[null,null,null,"P",0,null,"P",0,"043",null,null,null,0,0,"","",null,false,null,0,null,null,null,0,0,0,0,1,0,0,false,0,0,0,null,0,5,null,null,0,0,0,1,0,0,false,0,0,0,null,null,null,0,0,0]
[null,null,null,"P",0,null,"P",0,"044",null,null,null,0,0,"","",null,false,null,0,null,null,null,0,0,{"$f":"X55/$Z$4","v":0},{"$f":"(T55-$T$8)*2/$Z$4","v":0},{"$f":"SIN(Y55)*SIN(Z55)+COS(Y55)*COS(Z55)*COS(AA55)","v":1},0,0,{"$f":"IF(Y55<>Z55,90*(1+ABS(Y55-Z55)/(Y55-Z55)))","v":false},{"$f":"IF(AA55<>0,90+$Z$4*ATAN((SIN(Y55)*AB55-SIN(Z55))/(SIN(AA55)*COS(Y55)^2)),AE55*1)","v":0},{"$f":"IF(SIN(AA55)<0,AF55+180,AF55*1)","v":0},0,null,{"$f":"6365.11*AD55","v":0},5,null,null,{"$f":"X55/$Z$4","v":0},0,{"$f":"($T$8-T55)*2/$Z$4","v":0},{"$f":"SIN(AN55)*SIN(AO55)+COS(AN55)*COS(AO55)*COS(AP55)","v":1},0,{"$f":"IF(AC55<0,180/$Z$4+AC55,AC55)","v":0},{"$f":"IF(AN55<>AO55,90*(1+ABS(AN55-AO55)/(AN55-AO55)))","v":false},{"$f":"IF(AP55<>0,90+$Z$4*ATAN((SIN(AN55)*AQ55-SIN(AO55))/(SIN(AP55)*COS(AN55)^2)),AT55*1)","v":0},{"$f":"IF(SIN(AP55)<0,AU55+180,AU55*1)","v":0},0,null,null,null,0,0,0]
[null,null,null,"P",0,null,"P",0,"045",null,null,null,0,0,"","",null,false,null,0,null,null,null,0,0,0,0,1,0,0,false,0,0,0,null,0,5,null,null,0,0,0,1,0,0,false,0,0,0,null,null,null,0,0,0]
[null,null,null,"P",0,null,"P",0,"046",null,null,null,0,0,"","",null,false,null,0,null,null,null,0,0,0,0,1,0,0,false,0,0,0,null,0,5,null,null,0,0,0,1,0,0,false,0,0,0,null,null,null,0,0,0]
[null,null,null,"P",0,null,"P",0,"047",null,null,null,0,0,"","",null,false,null,0,null,null,null,0,0,0,0,1,0,0,false,0,0,0,null,0,5,null,null,0,0,0,1,0,0,false,0,0,0,null,null,null,0,0,0]
[null,null,null,"P",0,null,"P",0,"048",null,null,null,0,0,"","",null,false,null,0,null,null,null,0,0,0,0,1,0,0,false,0,0,0,null,0,5,null,null,0,0,0,1,0,0,false,0,0,0,null,null,null,0,0,0]
[null,null,null,"P",0,null,"P",0,"049",null,null,null,0,0,"","",null,false,null,0,null,null,null,0,0,0,0,1,0,0,false,0,0,0,null,0,5,null,null,0,0,0,1,0,0,false,0,0,0,null,null,null,0,0,0]
[null,null,null,"P",0,null,"P",0,"050",null,null,null,0,0,"","",null,false,null,0,null,null,null,0,0,0,0,1,0,0,false,0,0,0,null,0,5,null,null,0,0,0,1,0,0,false,0,0,0,null,null,null,{"$f":"M61","v":0},{"$f":"C61","v":0},{"$f":"K61","v":0}]
[null,null,null,null,null,null,null,null,null,null,null,null,null,null,null,null,null,null,null,null,null,null,null,null,null,null,null,null,null,null,null,null,null,null,null,null,null,null,null,null,null,null,null,null,null,null,null,null,null,null,null,null,null,null,null,0]

{"sheet":"9cm","index":8,"n_rows":62,"n_cols":57,"rows_kept":62,"cut":false,"hidden":false,"merged":[[5,2,5,7],[7,2,7,3],[7,9,7,10],[0,0,0,16],[7,7,7,8],[9,16,10,16],[9,1,10,1],[9,2,10,2],[9,3,10,5],[9,6,10,8],[9,9,10,9],[9,10,10,10],[9,11,10,11],[9,12,10,12],[9,13,10,13],[9,14,10,14],[9,15,10,15],[9,0,10,0],[3,6,3,8]]}
["ATV CONTEST LOG 9 cm"]
[]
[]
[null,null,null,null,null,null,null,null,null,null,null,{"$f":"IF(Summary!$V$3=1,\"Banda:\",\"Band:\")","v":"Banda:"},9,"cm",{"$f":"IF(Summary!$V$3=1,\"Analogico:\",\"Analogic\")","v":"Analogico:"},{"$f":"SUMIF($R$12:$R$61,\"=FALSO\",$N$12:$N$61)","v":0},null,null,null,null,null,null,null,null,"Deg/Rad :",{"$f":"180/PI()","v":57.295779513082323}]
[]
[{"$f":"IF(Summary!$V$3=1,\"Data:\",\"Date:\")","v":"Data:"},null,{"$f":"IF(Summary!B3=\"\",\"\",Summary!B3)","v":"2022-07-10"},null,null,null,null,null,null,null,null,{"$f":"IF(Summary!$V$3=1,\"Moltiplicatore:\",\"Multiplier:\")","v":"Moltiplicatore:"},{"$f":"Summary!$AI$43","v":8},null,{"$f":"IF(Summary!$V$3=1,\"Totale:\",\"Total:\")","v":"Totale:"},{"$f":"SUM(N12:N61)","v":0},{"$f":"IF(M4=70,1,IF(M4=24,2,IF(M4=23,2,IF(M4=13,5))))","v":false},{"$f":"IF(M4=9,\"5\",IF(M4=6,\"5\",IF(M4=3,\"5\",IF(M4=1.3,\"5\"))))","v":"5"},{"$f":"IF(M4=1.2,\"5\",IF(M4=0.6,\"5\",IF(M4=0.7,\"5\")))","v":false},"Longitude",null,null,null,"Latitude"]
[]
[{"$f":"IF(Summary!$V$3=1,\"Codice:\",\"Code:\")","v":"Codice:"},null,{"$f":"Summary!$B$26","v":0},null,null,null,null,{"$f":"IF(Summary!$V$3=1,\"Nominativo:\",\"Call:\")","v":"Nominativo:"},null,{"$f":"Summary!B5","v":0},null,{"$f":"IF(Summary!$V$3=1,\"Locatore WW:\",\"WW Locator:\")","v":"Locatore WW:"},{"$f":"Summary!B15","v":0},null,{"$f":"IF(Summary!$V$3=1,\"Digitale:\",\"Digital:\")","v":"Digitale:"},{"$f":"SUMIF($R$12:$R$61,\"=VERO\",$N$12:$N$61)","v":0},null,null,null,0,null,null,null,0]
[]
[{"$f":"IF(Summary!$V$3=1,\"Data\",\"Date\")","v":"Data"},{"$f":"IF(Summary!$V$3=1,\"Ora UTC\",\"Time UTC\")","v":"Ora UTC"},{"$f":"IF(Summary!$V$3=1,\"Stazioni Collegate\",\"Stations Worked\")","v":"Stazioni Collegate"},{"$f":"IF(Summary!$V$3=1,\"Rprt.+ Sequenza Ricevuta\",\"Rprt.+ Sequence Received\")","v":"Rprt.+ Sequenza Ricevuta"},null,null,{"$f":"IF(Summary!$V$3=1,\"Rpt.+ Sequenza Inviata\",\"Rpt.+ Sequence Sent\")","v":"Rpt.+ Sequenza Inviata"},null,null,{"$f":"IF(Summary!$V$3=1,\"Codice Ricevuto\",\"Code Received\")","v":"Codice Ricevuto"},{"$f":"IF(Summary!$V$3=1,\"Locatore WW\",\"WW Locator\")","v":"Locatore WW"},{"$f":"IF(Summary!$V$3=1,\"Commenti\",\"Comments\")","v":"Commenti"},{"$f":"IF(Summary!$V$3=1,\"Distanza Km\",\"Distance Km\")","v":"Distanza Km"},{"$f":"IF(Summary!$V$3=1,\"Punti\",\"Points\")","v":"Punti"},{"$f":"IF(Summary!$V$3=1,\"AZIMUT (Tuo)\",\"Heading (own)\")","v":"AZIMUT (Tuo)"},{"$f":"IF(Summary!$V$3=1,\"AZIMUT (Corrispondente)\",\"Heading (Other)\")","v":"AZIMUT (Corrispondente)"},{"$f":"IF(Summary!$V$3=1,\"DIGITALE?\",\"DIGITAL?\")","v":"DIGITALE?"},null,null,null,null,null,null,null,"Local Lat","Dist Lat","Diff Long",null,"Path Rad",null,null,null,null,null,null,null,null,null,null,"Dist Lat","Local Lat","Diff Long",null,"Path Rad",null,null,null,null,"Back"]
[null,null,null,null,null,null,null,null,null,null,null,null,null,null,null,null,null,null,null,"Longitude",null,null,null,"Latitude","A","B","L","E","D","Dcond","F1cond","F2cond","F3cond","Bearing",null,"R","Rint   km",null,null,"A","B","L","E","D","Dcond","F1cond","F2cond","F3cond","Bearing",null,null,null,"dx","call","locator","nr. QSO's","total km's"]
[null,null,null,"P",0,null,"P",0,"001",null,null,null,{"$f":"IF(K12<>\"\",AK12,0)","v":0},{"$f":"(IF(E12>1,M12,0)*$M$6/2)+(IF(H12>1,M12,0)*$M$6/2)","v":0},{"$f":"IF(K12<>0,AH12,\"\")","v":""},{"$f":"IF(K12<>0,AW12,\"\")","v":""},null,false,null,0,null,null,null,0,{"$f":"$X$8/$Z$4","v":0},{"$f":"X12/$Z$4","v":0},{"$f":"(T12-$T$8)*2/$Z$4","v":0},{"$f":"SIN(Y12)*SIN(Z12)+COS(Y12)*COS(Z12)*COS(AA12)","v":1},{"$f":"ATAN(SQRT(1-AB12*AB12)/AB12)","v":0},{"$f":"IF(AC12<0,180/$Z$4+AC12,AC12)","v":0},{"$f":"IF(Y12<>Z12,90*(1+ABS(Y12-Z12)/(Y12-Z12)))","v":false},{"$f":"IF(AA12<>0,90+$Z$4*ATAN((SIN(Y12)*AB12-SIN(Z12))/(SIN(AA12)*COS(Y12)^2)),AE12*1)","v":0},{"$f":"IF(SIN(AA12)<0,AF12+180,AF12*1)","v":0},{"$f":"INT(AG12)","v":0},null,{"$f":"6365.11*AD12","v":0},{"$f":"IF(AJ12<5,5,INT(AJ12+0.5))","v":5},null,null,{"$f":"X12/$Z$4","v":0},{"$f":"$X$8/$Z$4","v":0},{"$f":"($T$8-T12)*2/$Z$4","v":0},{"$f":"SIN(AN12)*SIN(AO12)+COS(AN12)*COS(AO12)*COS(AP12)","v":1},{"$f":"ATAN(SQRT(1-AQ12*AQ12)/AQ12)","v":0},{"$f":"IF(AC12<0,180/$Z$4+AC12,AC12)","v":0},{"$f":"IF(AN12<>AO12,90*(1+ABS(AN12-AO12)/(AN12-AO12)))","v":false},{"$f":"IF(AP12<>0,90+$Z$4*ATAN((SIN(AN12)*AQ12-SIN(AO12))/(SIN(AP12)*COS(AN12)^2)),AT12*1)","v":0},{"$f":"IF(SIN(AP12)<0,AU12+180,AU12*1)","v":0},{"$f":"INT(AV12)","v":0},null,null,null,{"$f":"M12","v":0},{"$f":"C12","v":0},{"$f":"K12","v":0},0,0]
[null,null,null,"P",0,null,"P",0,"002",null,null,null,{"$f":"IF(K13<>\"\",AK13,0)","v":0},{"$f":"(IF(E13>1,M13,0)*$M$6/2)+(IF(H13>1,M13,0)*$M$6/2)","v":0},"","",null,false,null,0,null,null,null,0,0,0,0,1,0,0,false,0,0,0,null,0,5,null,null,0,0,0,1,0,0,false,0,0,0,null,null,null,{"$f":"M13","v":0},{"$f":"C13","v":0},{"$f":"K13","v":0}]
[null,null,null,"P",0,null,"P",0,"003",null,null,null,0,0,"","",null,false,null,0,null,null,null,0,0,0,0,1,0,0,false,0,0,0,null,0,5,null,null,0,0,0,1,0,0,false,0,0,0,null,null,null,0,0,0]
[null,null,null,"P",0,null,"P",0,"004",null,null,null,0,0,"","",null,false,null,0,null,null,null,0,0,0,0,1,0,0,false,0,0,0,null,0,5,null,null,0,0,0,1,0,0,false,0,0,0,null,null,null,0,0,0]
[null,null,null,"P",0,null,"P",0,"005",null,null,null,0,0,"","",null,false,null,0,null,null,null,0,0,0,0,1,0,0,false,0,0,0,null,0,5,null,null,0,0,0,1,0,0,false,0,0,0,null,null,null,0,0,0]
[null,null,null,"P",0,null,"P",0,"006",null,null,null,0,0,"","",null,false,null,0,null,null,null,0,0,0,0,1,0,0,false,0,0,0,null,0,5,null,null,0,0,0,1,0,0,false,0,0,0,null,null,null,0,0,0]
[null,null,null,"P",0,null,"P",0,"007",null,null,null,0,0,"","",null,false,null,0,null,null,null,0,0,0,0,1,0,0,false,0,0,0,null,0,5,null,null,0,0,0,1,0,0,false,0,0,0,null,null,null,0,0,0]
[null,null,null,"P",0,null,"P",0,"008",null,null,null,0,0,"","",null,false,null,0,null,null,null,0,0,0,0,1,0,0,false,0,0,0,null,0,5,null,null,0,0,0,1,0,0,false,0,0,0,null,null,null,0,0,0]
[null,null,null,"P",0,null,"P",0,"009",null,null,null,0,0,"","",null,false,null,0,null,null,null,0,0,0,0,1,0,0,false,0,0,0,null,0,5,null,null,0,0,0,1,0,0,false,0,0,0,null,null,null,0,0,0]
[null,null,null,"P",0,null,"P",0,"010",null,null,null,0,0,"","",null,false,null,0,null,null,null,0,0,0,0,1,0,0,false,0,0,0,null,0,5,null,null,0,0,0,1,0,0,false,0,0,0,null,null,null,0,0,0]
[null,null,null,"P",0,null,"P",0,"011",null,null,null,0,0,"","",null,false,null,0,null,null,null,0,0,0,0,1,0,0,false,0,0,0,null,0,5,null,null,0,0,0,1,0,0,false,0,0,0,null,null,null,0,0,0]
[null,null,null,"P",0,null,"P",0,"012",null,null,null,0,0,"","",null,false,null,0,null,null,null,0,0,0,0,1,0,0,false,0,0,0,null,0,5,null,null,0,0,0,1,0,0,false,0,0,0,null,null,null,0,0,0]
[null,null,null,"P",0,null,"P",0,"013",null,null,null,0,0,"","",null,false,null,0,null,null,null,0,0,0,0,1,0,0,false,0,0,0,null,0,5,null,null,0,0,0,1,0,0,false,0,0,0,null,null,null,0,0,0]
[null,null,null,"P",0,null,"P",0,"014",null,null,null,0,0,"","",null,false,null,0,null,null,null,0,0,0,0,1,0,0,false,0,0,0,null,0,5,null,null,0,0,0,1,0,0,false,0,0,0,null,null,null,0,0,0]
[null,null,null,"P",0,null,"P",0,"015",null,null,null,0,0,"","",null,false,null,0,null,null,null,0,0,{"$f":"X26/$Z$4","v":0},{"$f":"(T26-$T$8)*2/$Z$4","v":0},{"$f":"SIN(Y26)*SIN(Z26)+COS(Y26)*COS(Z26)*COS(AA26)","v":1},0,0,{"$f":"IF(Y26<>Z26,90*(1+ABS(Y26-Z26)/(Y26-Z26)))","v":false},{"$f":"IF(AA26<>0,90+$Z$4*ATAN((SIN(Y26)*AB26-SIN(Z26))/(SIN(AA26)*COS(Y26)^2)),AE26*1)","v":0},{"$f":"IF(SIN(AA26)<0,AF26+180,AF26*1)","v":0},0,null,{"$f":"6365.11*AD26","v":0},5,null,null,{"$f":"X26/$Z$4","v":0},0,{"$f":"($T$8-T26)*2/$Z$4","v":0},{"$f":"SIN(AN26)*SIN(AO26)+COS(AN26)*COS(AO26)*COS(AP26)","v":1},0,{"$f":"IF(AC26<0,180/$Z$4+AC26,AC26)","v":0},{"$f":"IF(AN26<>AO26,90*(1+ABS(AN26-AO26)/(AN26-AO26)))","v":false},{"$f":"IF(AP26<>0,90+$Z$4*ATAN((SIN(AN26)*AQ26-SIN(AO26))/(SIN(AP26)*COS(AN26)^2)),AT26*1)","v":0},{"$f":"IF(SIN(AP26)<0,AU26+180,AU26*1)","v":0},0,null,null,null,0,0,0]
[null,null,null,"P",0,null,"P",0,"016",null,null,null,0,0,"","",null,false,null,0,null,null,null,0,0,0,0,1,0,0,false,0,0,0,null,0,5,null,null,0,0,0,1,0,0,false,0,0,0,null,null,null,0,0,0]
[null,null,null,"P",0,null,"P",0,"017",null,null,null,0,0,"","",null,false,null,0,null,null,null,0,0,0,0,1,0,0,false,0,0,0,null,0,5,null,null,0,0,0,1,0,0,false,0,0,0,null,null,null,0,0,0]
[null,null,null,"P",0,null,"P",0,"018",null,null,null,0,0,"","",null,false,null,0,null,null,null,0,0,0,0,1,0,0,false,0,0,0,null,0,5,null,null,0,0,0,1,0,0,false,0,0,0,null,null,null,0,0,0]
[null,null,null,"P",0,null,"P",0,"019",null,null,null,0,0,"","",null,false,null,0,null,null,null,0,0,0,0,1,0,0,false,0,0,0,null,0,5,null,null,0,0,0,1,0,0,false,0,0,0,null,null,null,0,0,0]
[null,null,null,"P",0,null,"P",0,"020",null,null,null,0,0,"","",null,false,null,0,null,null,null,0,0,0,0,1,0,0,false,0,0,0,null,0,5,null,null,0,0,0,1,0,0,false,0,0,0,null,null,null,0,0,0]
[null,null,null,"P",0,null,"P",0,"021",null,null,null,0,0,"","",null,false,null,0,null,null,null,0,0,0,0,1,0,0,false,0,0,0,null,0,5,null,null,0,0,0,1,0,0,false,0,0,0,null,null,null,0,0,0]
[null,null,null,"P",0,null,"P",0,"022",null,null,null,0,0,"","",null,false,null,0,null,null,null,0,0,0,0,1,0,0,false,0,0,0,null,0,5,null,null,0,0,0,1,0,0,false,0,0,0,null,null,null,0,0,0]
[null,null,null,"P",0,null,"P",0,"023",null,null,null,0,0,"","",null,false,null,0,null,null,null,0,0,0,0,1,0,0,false,0,0,0,null,0,5,null,null,0,0,0,1,0,0,false,0,0,0,null,null,null,0,0,0]
[null,null,null,"P",0,null,"P",0,"024",null,null,null,0,0,"","",null,false,null,0,null,null,null,0,0,0,0,1,0,0,false,0,0,0,null,0,5,null,null,0,0,0,1,0,0,false,0,0,0,null,null,null,0,0,0]
[null,null,null,"P",0,null,"P",0,"025",null,null,null,0,0,"","",null,false,null,0,null,null,null,0,0,0,0,1,0,0,false,0,0,0,null,0,5,null,null,0,0,0,1,0,0,false,0,0,0,null,null,null,0,0,0]
[null,null,null,"P",0,null,"P",0,"026",null,null,null,0,0,"","",null,false,null,0,null,null,null,0,0,0,0,1,0,0,false,0,0,0,null,0,5,null,null,0,0,0,1,0,0,false,0,0,0,null,null,null,{"$f":"M37","v":0},{"$f":"C37","v":0},{"$f":"K37","v":0}]
[null,null,null,"P",0,null,"P",0,"027",null,null,null,0,0,"","",null,false,null,0,null,null,null,0,0,0,0,1,0,0,false,0,0,0,null,0,5,null,null,0,0,0,1,0,0,false,0,0,0,null,null,null,{"$f":"M38","v":0},{"$f":"C38","v":0},{"$f":"K38","v":0}]
[null,null,null,"P",0,null,"P",0,"028",null,null,null,0,0,"","",null,false,null,0,null,null,null,0,0,0,0,1,0,0,false,0,0,0,null,0,5,null,null,0,0,0,1,0,0,false,0,0,0,null,null,null,{"$f":"M39","v":0},{"$f":"C39","v":0},{"$f":"K39","v":0}]
[null,null,null,"P",0,null,"P",0,"029",null,null,null,0,0,"","",null,false,null,0,null,null,null,0,0,0,0,1,0,0,false,0,0,0,null,0,5,null,null,0,0,0,1,0,0,false,0,0,0,null,null,null,{"$f":"M40","v":0},{"$f":"C40","v":0},{"$f":"K40","v":0}]
[null,null,null,"P",0,null,"P",0,"030",null,null,null,0,0,"","",null,false,null,0,null,null,null,0,0,0,0,1,0,0,false,0,0,0,null,0,5,null,null,0,0,0,1,0,0,false,0,0,0,null,null,null,{"$f":"M41","v":0},{"$f":"C41","v":0},{"$f":"K41","v":0}]
[null,null,null,"P",0,null,"P",0,"031",null,null,null,0,0,"","",null,false,null,0,null,null,null,0,0,0,0,1,0,0,false,0,0,0,null,0,5,null,null,0,0,0,1,0,0,false,0,0,0,null,null,null,{"$f":"M42","v":0},{"$f":"C42","v":0},{"$f":"K42","v":0}]
[null,null,null,"P",0,null,"P",0,"032",null,null,null,0,0,"","",null,false,null,0,null,null,null,0,0,0,0,1,0,0,false,0,0,0,null,0,5,null,null,0,0,0,1,0,0,false,0,0,0,null,null,null,0,0,0]
[null,null,null,"P",0,null,"P",0,"033",null,null,null,0,0,"","",null,false,null,0,null,null,null,0,0,0,0,1,0,0,false,0,0,0,null,0,5,null,null,0,0,0,1,0,0,false,0,0,0,null,null,null,0,0,0]
[null,null,null,"P",0,null,"P",0,"034",null,null,null,0,0,"","",null,false,null,0,null,null,null,0,0,0,0,1,0,0,false,0,0,0,null,0,5,null,null,0,0,0,1,0,0,false,0,0,0,null,null,null,0,0,0]
[null,null,null,"P",0,null,"P",0,"035",null,null,null,0,0,"","",null,false,null,0,null,null,null,0,0,0,0,1,0,0,false,0,0,0,null,0,5,null,null,0,0,0,1,0,0,false,0,0,0,null,null,null,0,0,0]
[null,null,null,"P",0,null,"P",0,"036",null,null,null,0,0,"","",null,false,null,0,null,null,null,0,0,0,0,1,0,0,false,0,0,0,null,0,5,null,null,0,0,0,1,0,0,false,0,0,0,null,null,null,0,0,0]
[null,null,null,"P",0,null,"P",0,"037",null,null,null,0,0,"","",null,false,null,0,null,null,null,0,0,0,0,1,0,0,false,0,0,0,null,0,5,null,null,0,0,0,1,0,0,false,0,0,0,null,null,null,0,0,0]
[null,null,null,"P",0,null,"P",0,"038",null,null,null,0,0,"","",null,false,null,0,null,null,null,0,0,0,0,1,0,0,false,0,0,0,null,0,5,null,null,0,0,0,1,0,0,false,0,0,0,null,null,null,0,0,0]
[null,null,null,"P",0,null,"P",0,"039",null,null,null,0,0,"","",null,false,null,0,null,null,null,0,0,0,0,1,0,0,false,0,0,0,null,0,5,null,null,0,0,0,1,0,0,false,0,0,0,null,null,null,0,0,0]
[null,null,null,"P",0,null,"P",0,"040",null,null,null,0,0,"","",null,false,null,0,null,null,null,0,0,0,0,1,0,0,false,0,0,0,null,0,5,null,null,0,0,0,1,0,0,false,0,0,0,null,null,null,0,0,0]
[null,null,null,"P",0,null,"P",0,"041",null,null,null,0,0,"","",null,false,null,0,null,null,null,0,0,0,0,1,0,0,false,0,0,0,null,0,5,null,null,0,0,0,1,0,0,false,0,0,0,null,null,null,0,0,0]
[null,null,null,"P",0,null,"P",0,"042",null,null,null,0,0,"","",null,false,null,0,null,null,null,0,0,0,0,1,0,0,false,0,0,0,null,0,5,null,null,0,0,0,1,0,0,false,0,0,0,null,null,null,0,0,0]
[null,null,null,"P",0,null,"P",0,"043",null,null,null,0,0,"","",null,false,null,0,null,null,null,0,0,0,0,1,0,0,false,0,0,0,null,0,5,null,null,0,0,0,1,0,0,false,0,0,0,null,null,null,0,0,0]
[null,null,null,"P",0,null,"P",0,"044",null,null,null,0,0,"","",null,false,null,0,null,null,null,0,0,0,0,1,0,0,false,0,0,0,null,0,5,null,null,0,0,0,1,0,0,false,0,0,0,null,null,null,0,0,0]
[null,null,null,"P",0,null,"P",0,"045",null,null,null,0,0,"","",null,false,null,0,null,null,null,0,0,0,0,1,0,0,false,0,0,0,null,0,5,null,null,0,0,0,1,0,0,false,0,0,0,null,null,null,0,0,0]
[null,null,null,"P",0,null,"P",0,"046",null,null,null,0,0,"","",null,false,null,0,null,null,null,0,0,0,0,1,0,0,false,0,0,0,null,0,5,null,null,0,0,0,1,0,0,false,0,0,0,null,null,null,0,0,0]
[null,null,null,"P",0,null,"P",0,"047",null,null,null,0,0,"","",null,false,null,0,null,null,null,0,0,0,0,1,0,0,false,0,0,0,null,0,5,null,null,0,0,0,1,0,0,false,0,0,0,null,null,null,0,0,0]
[null,null,null,"P",0,null,"P",0,"048",null,null,null,0,0,"","",null,false,null,0,null,null,null,0,0,0,0,1,0,0,false,0,0,0,null,0,5,null,null,0,0,0,1,0,0,false,0,0,0,null,null,null,0,0,0]
[null,null,null,"P",0,null,"P",0,"049",null,null,null,0,0,"","",null,false,null,0,null,null,null,0,0,0,0,1,0,0,false,0,0,0,null,0,5,null,null,0,0,0,1,0,0,false,0,0,0,null,null,null,0,0,0]
[null,null,null,"P",0,null,"P",0,"050",null,null,null,0,0,"","",null,false,null,0,null,null,null,0,0,0,0,1,0,0,false,0,0,0,null,0,5,null,null,0,0,0,1,0,0,false,0,0,0,null,null,null,0,0,0]
[null,null,null,null,null,null,null,null,null,null,null,null,null,null,null,null,null,null,null,null,null,null,null,null,null,null,null,null,null,null,null,null,null,null,null,null,null,null,null,null,null,null,null,null,null,null,null,null,null,null,null,null,null,null,null,0]

{"sheet":"6cm","index":9,"n_rows":62,"n_cols":57,"rows_kept":62,"cut":false,"hidden":false,"merged":[[5,2,5,7],[7,2,7,3],[7,9,7,10],[0,0,0,16],[7,7,7,8],[9,16,10,16],[9,1,10,1],[9,2,10,2],[9,3,10,5],[9,6,10,8],[9,9,10,9],[9,10,10,10],[9,11,10,11],[9,12,10,12],[9,13,10,13],[9,14,10,14],[9,15,10,15],[9,0,10,0],[3,6,3,8]]}
["ATV CONTEST LOG 6 cm"]
[]
[]
[null,null,null,null,null,null,null,null,null,null,null,{"$f":"IF(Summary!$V$3=1,\"Banda:\",\"Band:\")","v":"Banda:"},6,"cm",{"$f":"IF(Summary!$V$3=1,\"Analogico:\",\"Analogic\")","v":"Analogico:"},{"$f":"SUMIF($R$12:$R$61,\"=FALSO\",$N$12:$N$61)","v":0},null,null,null,null,null,null,null,null,"Deg/Rad :",{"$f":"180/PI()","v":57.295779513082323}]
[]
[{"$f":"IF(Summary!$V$3=1,\"Data:\",\"Date:\")","v":"Data:"},null,{"$f":"IF(Summary!B3=\"\",\"\",Summary!B3)","v":"2022-07-10"},null,null,null,null,null,null,null,null,{"$f":"IF(Summary!$V$3=1,\"Moltiplicatore:\",\"Multiplier:\")","v":"Moltiplicatore:"},{"$f":"Summary!$AI$44","v":8},null,{"$f":"IF(Summary!$V$3=1,\"Totale:\",\"Total:\")","v":"Totale:"},{"$f":"SUM(N12:N61)","v":0},{"$f":"IF(M4=70,1,IF(M4=24,2,IF(M4=23,2,IF(M4=13,5))))","v":false},{"$f":"IF(M4=9,\"5\",IF(M4=6,\"5\",IF(M4=3,\"5\",IF(M4=1.3,\"5\"))))","v":"5"},{"$f":"IF(M4=1.2,\"5\",IF(M4=0.6,\"5\",IF(M4=0.7,\"5\")))","v":false},"Longitude",null,null,null,"Latitude"]
[]
[{"$f":"IF(Summary!$V$3=1,\"Codice:\",\"Code:\")","v":"Codice:"},null,{"$f":"Summary!B27","v":0},null,null,null,null,{"$f":"IF(Summary!$V$3=1,\"Nominativo:\",\"Call:\")","v":"Nominativo:"},null,{"$f":"Summary!B5","v":0},null,{"$f":"IF(Summary!$V$3=1,\"Locatore WW:\",\"WW Locator:\")","v":"Locatore WW:"},{"$f":"Summary!B15","v":0},null,{"$f":"IF(Summary!$V$3=1,\"Digitale:\",\"Digital:\")","v":"Digitale:"},{"$f":"SUMIF($R$12:$R$61,\"=VERO\",$N$12:$N$61)","v":0},null,null,null,0,null,null,null,0]
[]
[{"$f":"IF(Summary!$V$3=1,\"Data\",\"Date\")","v":"Data"},{"$f":"IF(Summary!$V$3=1,\"Ora UTC\",\"Time UTC\")","v":"Ora UTC"},{"$f":"IF(Summary!$V$3=1,\"Stazioni Collegate\",\"Stations Worked\")","v":"Stazioni Collegate"},{"$f":"IF(Summary!$V$3=1,\"Rprt.+ Sequenza Ricevuta\",\"Rprt.+ Sequence Received\")","v":"Rprt.+ Sequenza Ricevuta"},null,null,{"$f":"IF(Summary!$V$3=1,\"Rpt.+ Sequenza Inviata\",\"Rpt.+ Sequence Sent\")","v":"Rpt.+ Sequenza Inviata"},null,null,{"$f":"IF(Summary!$V$3=1,\"Codice Ricevuto\",\"Code Received\")","v":"Codice Ricevuto"},{"$f":"IF(Summary!$V$3=1,\"Locatore WW\",\"WW Locator\")","v":"Locatore WW"},{"$f":"IF(Summary!$V$3=1,\"Commenti\",\"Comments\")","v":"Commenti"},{"$f":"IF(Summary!$V$3=1,\"Distanza Km\",\"Distance Km\")","v":"Distanza Km"},{"$f":"IF(Summary!$V$3=1,\"Punti\",\"Points\")","v":"Punti"},{"$f":"IF(Summary!$V$3=1,\"AZIMUT (Tuo)\",\"Heading (own)\")","v":"AZIMUT (Tuo)"},{"$f":"IF(Summary!$V$3=1,\"AZIMUT (Corrispondente)\",\"Heading (Other)\")","v":"AZIMUT (Corrispondente)"},{"$f":"IF(Summary!$V$3=1,\"DIGITALE?\",\"DIGITAL?\")","v":"DIGITALE?"},null,null,null,null,null,null,null,"Local Lat","Dist Lat","Diff Long",null,"Path Rad",null,null,null,null,null,null,null,null,null,null,"Dist Lat","Local Lat","Diff Long",null,"Path Rad",null,null,null,null,"Back"]
[null,null,null,null,null,null,null,null,null,null,null,null,null,null,null,null,null,null,null,"Longitude",null,null,null,"Latitude","A","B","L","E","D","Dcond","F1cond","F2cond","F3cond","Bearing",null,"R","Rint   km",null,null,"A","B","L","E","D","Dcond","F1cond","F2cond","F3cond","Bearing",null,null,null,"dx","call","locator","nr. QSO's","total km's"]
[null,null,null,"P",0,null,"P",0,"001",null,null,null,{"$f":"IF(K12<>\"\",AK12,0)","v":0},{"$f":"(IF(E12>1,M12,0)*$M$6/2)+(IF(H12>1,M12,0)*$M$6/2)","v":0},{"$f":"IF(K12<>0,AH12,\"\")","v":""},{"$f":"IF(K12<>0,AW12,\"\")","v":""},null,false,null,0,null,null,null,0,{"$f":"$X$8/$Z$4","v":0},{"$f":"X12/$Z$4","v":0},{"$f":"(T12-$T$8)*2/$Z$4","v":0},{"$f":"SIN(Y12)*SIN(Z12)+COS(Y12)*COS(Z12)*COS(AA12)","v":1},{"$f":"ATAN(SQRT(1-AB12*AB12)/AB12)","v":0},{"$f":"IF(AC12<0,180/$Z$4+AC12,AC12)","v":0},{"$f":"IF(Y12<>Z12,90*(1+ABS(Y12-Z12)/(Y12-Z12)))","v":false},{"$f":"IF(AA12<>0,90+$Z$4*ATAN((SIN(Y12)*AB12-SIN(Z12))/(SIN(AA12)*COS(Y12)^2)),AE12*1)","v":0},{"$f":"IF(SIN(AA12)<0,AF12+180,AF12*1)","v":0},{"$f":"INT(AG12)","v":0},null,{"$f":"6365.11*AD12","v":0},{"$f":"IF(AJ12<5,5,INT(AJ12+0.5))","v":5},null,null,{"$f":"X12/$Z$4","v":0},{"$f":"$X$8/$Z$4","v":0},{"$f":"($T$8-T12)*2/$Z$4","v":0},{"$f":"SIN(AN12)*SIN(AO12)+COS(AN12)*COS(AO12)*COS(AP12)","v":1},{"$f":"ATAN(SQRT(1-AQ12*AQ12)/AQ12)","v":0},{"$f":"IF(AC12<0,180/$Z$4+AC12,AC12)","v":0},{"$f":"IF(AN12<>AO12,90*(1+ABS(AN12-AO12)/(AN12-AO12)))","v":false},{"$f":"IF(AP12<>0,90+$Z$4*ATAN((SIN(AN12)*AQ12-SIN(AO12))/(SIN(AP12)*COS(AN12)^2)),AT12*1)","v":0},{"$f":"IF(SIN(AP12)<0,AU12+180,AU12*1)","v":0},{"$f":"INT(AV12)","v":0},null,null,null,{"$f":"M12","v":0},{"$f":"C12","v":0},{"$f":"K12","v":0},0,0]
[null,null,null,"P",0,null,"P",0,"002",null,null,null,{"$f":"IF(K13<>\"\",AK13,0)","v":0},{"$f":"(IF(E13>1,M13,0)*$M$6/2)+(IF(H13>1,M13,0)*$M$6/2)","v":0},"","",null,false,null,0,null,null,null,0,0,0,0,1,0,0,false,0,0,0,null,0,5,null,null,0,0,0,1,0,0,false,0,0,0,null,null,null,{"$f":"M13","v":0},{"$f":"C13","v":0},{"$f":"K13","v":0}]
[null,null,null,"P",0,null,"P",0,"003",null,null,null,0,0,"","",null,false,null,0,null,null,null,0,0,0,0,1,0,0,false,0,0,0,null,0,5,null,null,0,0,0,1,0,0,false,0,0,0,null,null,null,0,0,0]
[null,null,null,"P",0,null,"P",0,"004",null,null,null,0,0,"","",null,false,null,0,null,null,null,0,0,0,0,1,0,0,false,0,0,0,null,0,5,null,null,0,0,0,1,0,0,false,0,0,0,null,null,null,0,0,0]
[null,null,null,"P",0,null,"P",0,"005",null,null,null,0,0,"","",null,false,null,0,null,null,null,0,0,0,0,1,0,0,false,0,0,0,null,0,5,null,null,0,0,0,1,0,0,false,0,0,0,null,null,null,0,0,0]
[null,null,null,"P",0,null,"P",0,"006",null,null,null,0,0,"","",null,false,null,0,null,null,null,0,0,0,0,1,0,0,false,0,0,0,null,0,5,null,null,0,0,0,1,0,0,false,0,0,0,null,null,null,0,0,0]
[null,null,null,"P",0,null,"P",0,"007",null,null,null,0,0,"","",null,false,null,0,null,null,null,0,0,0,0,1,0,0,false,0,0,0,null,0,5,null,null,0,0,0,1,0,0,false,0,0,0,null,null,null,0,0,0]
[null,null,null,"P",0,null,"P",0,"008",null,null,null,0,0,"","",null,false,null,0,null,null,null,0,0,0,0,1,0,0,false,0,0,0,null,0,5,null,null,0,0,0,1,0,0,false,0,0,0,null,null,null,0,0,0]
[null,null,null,"P",0,null,"P",0,"009",null,null,null,0,0,"","",null,false,null,0,null,null,null,0,0,0,0,1,0,0,false,0,0,0,null,0,5,null,null,0,0,0,1,0,0,false,0,0,0,null,null,null,0,0,0]
[null,null,null,"P",0,null,"P",0,"010",null,null,null,0,0,"","",null,false,null,0,null,null,null,0,0,0,0,1,0,0,false,0,0,0,null,0,5,null,null,0,0,0,1,0,0,false,0,0,0,null,null,null,0,0,0]
[null,null,null,"P",0,null,"P",0,"011",null,null,null,0,0,"","",null,false,null,0,null,null,null,0,0,0,0,1,0,0,false,0,0,0,null,0,5,null,null,0,0,0,1,0,0,false,0,0,0,null,null,null,0,0,0]
[null,null,null,"P",0,null,"P",0,"012",null,null,null,0,0,"","",null,false,null,0,null,null,null,0,0,0,0,1,0,0,false,0,0,0,null,0,5,null,null,0,0,0,1,0,0,false,0,0,0,null,null,null,0,0,0]
[null,null,null,"P",0,null,"P",0,"013",null,null,null,0,0,"","",null,false,null,0,null,null,null,0,0,0,0,1,0,0,false,0,0,0,null,0,5,null,null,0,0,0,1,0,0,false,0,0,0,null,null,null,0,0,0]
[null,null,null,"P",0,null,"P",0,"014",null,null,null,0,0,"","",null,false,null,0,null,null,null,0,0,0,0,1,0,0,false,0,0,0,null,0,5,null,null,0,0,0,1,0,0,false,0,0,0,null,null,null,0,0,0]
[null,null,null,"P",0,null,"P",0,"015",null,null,null,0,0,"","",null,false,null,0,null,null,null,0,0,{"$f":"X26/$Z$4","v":0},{"$f":"(T26-$T$8)*2/$Z$4","v":0},{"$f":"SIN(Y26)*SIN(Z26)+COS(Y26)*COS(Z26)*COS(AA26)","v":1},0,0,{"$f":"IF(Y26<>Z26,90*(1+ABS(Y26-Z26)/(Y26-Z26)))","v":false},{"$f":"IF(AA26<>0,90+$Z$4*ATAN((SIN(Y26)*AB26-SIN(Z26))/(SIN(AA26)*COS(Y26)^2)),AE26*1)","v":0},{"$f":"IF(SIN(AA26)<0,AF26+180,AF26*1)","v":0},0,null,{"$f":"6365.11*AD26","v":0},5,null,null,{"$f":"X26/$Z$4","v":0},0,{"$f":"($T$8-T26)*2/$Z$4","v":0},{"$f":"SIN(AN26)*SIN(AO26)+COS(AN26)*COS(AO26)*COS(AP26)","v":1},0,{"$f":"IF(AC26<0,180/$Z$4+AC26,AC26)","v":0},{"$f":"IF(AN26<>AO26,90*(1+ABS(AN26-AO26)/(AN26-AO26)))","v":false},{"$f":"IF(AP26<>0,90+$Z$4*ATAN((SIN(AN26)*AQ26-SIN(AO26))/(SIN(AP26)*COS(AN26)^2)),AT26*1)","v":0},{"$f":"IF(SIN(AP26)<0,AU26+180,AU26*1)","v":0},0,null,null,null,0,0,0]
[null,null,null,"P",0,null,"P",0,"016",null,null,null,0,0,"","",null,false,null,0,null,null,null,0,0,0,0,1,0,0,false,0,0,0,null,0,5,null,null,0,0,0,1,0,0,false,0,0,0,null,null,null,0,0,0]
[null,null,null,"P",0,null,"P",0,"017",null,null,null,0,0,"","",null,false,null,0,null,null,null,0,0,0,0,1,0,0,false,0,0,0,null,0,5,null,null,0,0,0,1,0,0,false,0,0,0,null,null,null,0,0,0]
[null,null,null,"P",0,null,"P",0,"018",null,null,null,0,0,"","",null,false,null,0,null,null,null,0,0,0,0,1,0,0,false,0,0,0,null,0,5,null,null,0,0,0,1,0,0,false,0,0,0,null,null,null,0,0,0]
[null,null,null,"P",0,null,"P",0,"019",null,null,null,0,0,"","",null,false,null,0,null,null,null,0,0,0,0,1,0,0,false,0,0,0,null,0,5,null,null,0,0,0,1,0,0,false,0,0,0,null,null,null,0,0,0]
[null,null,null,"P",0,null,"P",0,"020",null,null,null,0,0,"","",null,false,null,0,null,null,null,0,0,0,0,1,0,0,false,0,0,0,null,0,5,null,null,0,0,0,1,0,0,false,0,0,0,null,null,null,0,0,0]
[null,null,null,"P",0,null,"P",0,"021",null,null,null,0,0,"","",null,false,null,0,null,null,null,0,0,0,0,1,0,0,false,0,0,0,null,0,5,null,null,0,0,0,1,0,0,false,0,0,0,null,null,null,0,0,0]
[null,null,null,"P",0,null,"P",0,"022",null,null,null,0,0,"","",null,false,null,0,null,null,null,0,0,0,0,1,0,0,false,0,0,0,null,0,5,null,null,0,0,0,1,0,0,false,0,0,0,null,null,null,0,0,0]
[null,null,null,"P",0,null,"P",0,"023",null,null,null,0,0,"","",null,false,null,0,null,null,null,0,0,0,0,1,0,0,false,0,0,0,null,0,5,null,null,0,0,0,1,0,0,false,0,0,0,null,null,null,0,0,0]
[null,null,null,"P",0,null,"P",0,"024",null,null,null,0,0,"","",null,false,null,0,null,null,null,0,0,0,0,1,0,0,false,0,0,0,null,0,5,null,null,0,0,0,1,0,0,false,0,0,0,null,null,null,0,0,0]
[null,null,null,"P",0,null,"P",0,"025",null,null,null,0,0,"","",null,false,null,0,null,null,null,0,0,0,0,1,0,0,false,0,0,0,null,0,5,null,null,0,0,0,1,0,0,false,0,0,0,null,null,null,0,0,0]
[null,null,null,"P",0,null,"P",0,"026",null,null,null,0,0,"","",null,false,null,0,null,null,null,0,0,0,0,1,0,0,false,0,0,0,null,0,5,null,null,0,0,0,1,0,0,false,0,0,0,null,null,null,{"$f":"M37","v":0},{"$f":"C37","v":0},{"$f":"K37","v":0}]
[null,null,null,"P",0,null,"P",0,"027",null,null,null,0,0,"","",null,false,null,0,null,null,null,0,0,0,0,1,0,0,false,0,0,0,null,0,5,null,null,0,0,0,1,0,0,false,0,0,0,null,null,null,{"$f":"M38","v":0},{"$f":"C38","v":0},{"$f":"K38","v":0}]
[null,null,null,"P",0,null,"P",0,"028",null,null,null,0,0,"","",null,false,null,0,null,null,null,0,0,0,0,1,0,0,false,0,0,0,null,0,5,null,null,0,0,0,1,0,0,false,0,0,0,null,null,null,{"$f":"M39","v":0},{"$f":"C39","v":0},{"$f":"K39","v":0}]
[null,null,null,"P",0,null,"P",0,"029",null,null,null,0,0,"","",null,false,null,0,null,null,null,0,0,0,0,1,0,0,false,0,0,0,null,0,5,null,null,0,0,0,1,0,0,false,0,0,0,null,null,null,{"$f":"M40","v":0},{"$f":"C40","v":0},{"$f":"K40","v":0}]
[null,null,null,"P",0,null,"P",0,"030",null,null,null,0,0,"","",null,false,null,0,null,null,null,0,0,0,0,1,0,0,false,0,0,0,null,0,5,null,null,0,0,0,1,0,0,false,0,0,0,null,null,null,{"$f":"M41","v":0},{"$f":"C41","v":0},{"$f":"K41","v":0}]
[null,null,null,"P",0,null,"P",0,"031",null,null,null,0,0,"","",null,false,null,0,null,null,null,0,0,0,0,1,0,0,false,0,0,0,null,0,5,null,null,0,0,0,1,0,0,false,0,0,0,null,null,null,{"$f":"M42","v":0},{"$f":"C42","v":0},{"$f":"K42","v":0}]
[null,null,null,"P",0,null,"P",0,"032",null,null,null,0,0,"","",null,false,null,0,null,null,null,0,0,0,0,1,0,0,false,0,0,0,null,0,5,null,null,0,0,0,1,0,0,false,0,0,0,null,null,null,0,0,0]
[null,null,null,"P",0,null,"P",0,"033",null,null,null,0,0,"","",null,false,null,0,null,null,null,0,0,0,0,1,0,0,false,0,0,0,null,0,5,null,null,0,0,0,1,0,0,false,0,0,0,null,null,null,0,0,0]
[null,null,null,"P",0,null,"P",0,"034",null,null,null,0,0,"","",null,false,null,0,null,null,null,0,0,0,0,1,0,0,false,0,0,0,null,0,5,null,null,0,0,0,1,0,0,false,0,0,0,null,null,null,0,0,0]
[null,null,null,"P",0,null,"P",0,"035",null,null,null,0,0,"","",null,false,null,0,null,null,null,0,0,0,0,1,0,0,false,0,0,0,null,0,5,null,null,0,0,0,1,0,0,false,0,0,0,null,null,null,0,0,0]
[null,null,null,"P",0,null,"P",0,"036",null,null,null,0,0,"","",null,false,null,0,null,null,null,0,0,0,0,1,0,0,false,0,0,0,null,0,5,null,null,0,0,0,1,0,0,false,0,0,0,null,null,null,0,0,0]
[null,null,null,"P",0,null,"P",0,"037",null,null,null,0,0,"","",null,false,null,0,null,null,null,0,0,0,0,1,0,0,false,0,0,0,null,0,5,null,null,0,0,0,1,0,0,false,0,0,0,null,null,null,0,0,0]
[null,null,null,"P",0,null,"P",0,"038",null,null,null,0,0,"","",null,false,null,0,null,null,null,0,0,0,0,1,0,0,false,0,0,0,null,0,5,null,null,0,0,0,1,0,0,false,0,0,0,null,null,null,0,0,0]
[null,null,null,"P",0,null,"P",0,"039",null,null,null,0,0,"","",null,false,null,0,null,null,null,0,0,0,0,1,0,0,false,0,0,0,null,0,5,null,null,0,0,0,1,0,0,false,0,0,0,null,null,null,0,0,0]
[null,null,null,"P",0,null,"P",0,"040",null,null,null,0,0,"","",null,false,null,0,null,null,null,0,0,0,0,1,0,0,false,0,0,0,null,0,5,null,null,0,0,0,1,0,0,false,0,0,0,null,null,null,0,0,0]
[null,null,null,"P",0,null,"P",0,"041",null,null,null,0,0,"","",null,false,null,0,null,null,null,0,0,0,0,1,0,0,false,0,0,0,null,0,5,null,null,0,0,0,1,0,0,false,0,0,0,null,null,null,0,0,0]
[null,null,null,"P",0,null,"P",0,"042",null,null,null,0,0,"","",null,false,null,0,null,null,null,0,0,0,0,1,0,0,false,0,0,0,null,0,5,null,null,0,0,0,1,0,0,false,0,0,0,null,null,null,0,0,0]
[null,null,null,"P",0,null,"P",0,"043",null,null,null,0,0,"","",null,false,null,0,null,null,null,0,0,0,0,1,0,0,false,0,0,0,null,0,5,null,null,0,0,0,1,0,0,false,0,0,0,null,null,null,0,0,0]
[null,null,null,"P",0,null,"P",0,"044",null,null,null,0,0,"","",null,false,null,0,null,null,null,0,0,0,0,1,0,0,false,0,0,0,null,0,5,null,null,0,0,0,1,0,0,false,0,0,0,null,null,null,0,0,0]
[null,null,null,"P",0,null,"P",0,"045",null,null,null,0,0,"","",null,false,null,0,null,null,null,0,0,0,0,1,0,0,false,0,0,0,null,0,5,null,null,0,0,0,1,0,0,false,0,0,0,null,null,null,0,0,0]
[null,null,null,"P",0,null,"P",0,"046",null,null,null,0,0,"","",null,false,null,0,null,null,null,0,0,0,0,1,0,0,false,0,0,0,null,0,5,null,null,0,0,0,1,0,0,false,0,0,0,null,null,null,0,0,0]
[null,null,null,"P",0,null,"P",0,"047",null,null,null,0,0,"","",null,false,null,0,null,null,null,0,0,0,0,1,0,0,false,0,0,0,null,0,5,null,null,0,0,0,1,0,0,false,0,0,0,null,null,null,0,0,0]
[null,null,null,"P",0,null,"P",0,"048",null,null,null,0,0,"","",null,false,null,0,null,null,null,0,0,0,0,1,0,0,false,0,0,0,null,0,5,null,null,0,0,0,1,0,0,false,0,0,0,null,null,null,0,0,0]
[null,null,null,"P",0,null,"P",0,"049",null,null,null,0,0,"","",null,false,null,0,null,null,null,0,0,0,0,1,0,0,false,0,0,0,null,0,5,null,null,0,0,0,1,0,0,false,0,0,0,null,null,null,0,0,0]
[null,null,null,"P",0,null,"P",0,"050",null,null,null,0,0,"","",null,false,null,0,null,null,null,0,0,0,0,1,0,0,false,0,0,0,null,0,5,null,null,0,0,0,1,0,0,false,0,0,0,null,null,null,0,0,0]
[null,null,null,null,null,null,null,null,null,null,null,null,null,null,null,null,null,null,null,null,null,null,null,null,null,null,null,null,null,null,null,null,null,null,null,null,null,null,null,null,null,null,null,null,null,null,null,null,null,null,null,null,null,null,null,0]

{"sheet":"3cm","index":10,"n_rows":62,"n_cols":57,"rows_kept":62,"cut":false,"hidden":false,"merged":[[7,2,7,3],[7,9,7,10],[3,6,3,8],[0,0,0,16],[7,7,7,8],[9,16,10,16],[9,1,10,1],[9,2,10,2],[9,3,10,5],[9,6,10,8],[9,9,10,9],[9,10,10,10],[9,11,10,11],[9,12,10,12],[9,13,10,13],[9,14,10,14],[9,15,10,15],[9,0,10,0],[5,2,5,7]]}
["ATV CONTEST LOG 3 cm"]
[]
[]
[null,null,null,null,null,null,null,null,null,null,null,{"$f":"IF(Summary!$V$3=1,\"Banda:\",\"Band:\")","v":"Banda:"},3,"cm",{"$f":"IF(Summary!$V$3=1,\"Analogico:\",\"Analogic\")","v":"Analogico:"},{"$f":"SUMIF($R$12:$R$61,\"=FALSO\",$N$12:$N$61)","v":0},null,null,null,null,null,null,null,null,"Deg/Rad :",{"$f":"180/PI()","v":57.295779513082323}]
[]
[{"$f":"IF(Summary!$V$3=1,\"Data:\",\"Date:\")","v":"Data:"},null,{"$f":"IF(Summary!B3=\"\",\"\",Summary!B3)","v":"2022-07-10"},null,null,null,null,null,null,null,null,{"$f":"IF(Summary!$V$3=1,\"Moltiplicatore:\",\"Multiplier:\")","v":"Moltiplicatore:"},{"$f":"Summary!$AI$45","v":8},null,{"$f":"IF(Summary!$V$3=1,\"Totale:\",\"Total:\")","v":"Totale:"},{"$f":"SUM(N12:N61)","v":0},{"$f":"IF(M4=70,1,IF(M4=24,2,IF(M4=23,2,IF(M4=13,5))))","v":false},{"$f":"IF(M4=9,\"5\",IF(M4=6,\"5\",IF(M4=3,\"5\",IF(M4=1.3,\"5\"))))","v":"5"},{"$f":"IF(M4=1.2,\"5\",IF(M4=0.6,\"5\",IF(M4=0.7,\"5\")))","v":false},"Longitude",null,null,null,"Latitude"]
[]
[{"$f":"IF(Summary!$V$3=1,\"Codice:\",\"Code:\")","v":"Codice:"},null,{"$f":"Summary!$B$28","v":0},null,null,null,null,{"$f":"IF(Summary!$V$3=1,\"Nominativo:\",\"Call:\")","v":"Nominativo:"},null,{"$f":"Summary!B5","v":0},null,{"$f":"IF(Summary!$V$3=1,\"Locatore WW:\",\"WW Locator:\")","v":"Locatore WW:"},{"$f":"Summary!B15","v":0},null,{"$f":"IF(Summary!$V$3=1,\"Digitale:\",\"Digital:\")","v":"Digitale:"},{"$f":"SUMIF($R$12:$R$61,\"=VERO\",$N$12:$N$61)","v":0},null,null,null,0,null,null,null,0]
[]
[{"$f":"IF(Summary!$V$3=1,\"Data\",\"Date\")","v":"Data"},{"$f":"IF(Summary!$V$3=1,\"Ora UTC\",\"Time UTC\")","v":"Ora UTC"},{"$f":"IF(Summary!$V$3=1,\"Stazioni Collegate\",\"Stations Worked\")","v":"Stazioni Collegate"},{"$f":"IF(Summary!$V$3=1,\"Rprt.+ Sequenza Ricevuta\",\"Rprt.+ Sequence Received\")","v":"Rprt.+ Sequenza Ricevuta"},null,null,{"$f":"IF(Summary!$V$3=1,\"Rpt.+ Sequenza Inviata\",\"Rpt.+ Sequence Sent\")","v":"Rpt.+ Sequenza Inviata"},null,null,{"$f":"IF(Summary!$V$3=1,\"Codice Ricevuto\",\"Code Received\")","v":"Codice Ricevuto"},{"$f":"IF(Summary!$V$3=1,\"Locatore WW\",\"WW Locator\")","v":"Locatore WW"},{"$f":"IF(Summary!$V$3=1,\"Commenti\",\"Comments\")","v":"Commenti"},{"$f":"IF(Summary!$V$3=1,\"Distanza Km\",\"Distance Km\")","v":"Distanza Km"},{"$f":"IF(Summary!$V$3=1,\"Punti\",\"Points\")","v":"Punti"},{"$f":"IF(Summary!$V$3=1,\"AZIMUT (Tuo)\",\"Heading (own)\")","v":"AZIMUT (Tuo)"},{"$f":"IF(Summary!$V$3=1,\"AZIMUT (Corrispondente)\",\"Heading (Other)\")","v":"AZIMUT (Corrispondente)"},{"$f":"IF(Summary!$V$3=1,\"DIGITALE?\",\"DIGITAL?\")","v":"DIGITALE?"},null,null,null,null,null,null,null,"Local Lat","Dist Lat","Diff Long",null,"Path Rad",null,null,null,null,null,null,null,null,null,null,"Dist Lat","Local Lat","Diff Long",null,"Path Rad",null,null,null,null,"Back"]
[null,null,null,null,null,null,null,null,null,null,null,null,null,null,null,null,null,null,null,"Longitude",null,null,null,"Latitude","A","B","L","E","D","Dcond","F1cond","F2cond","F3cond","Bearing",null,"R","Rint   km",null,null,"A","B","L","E","D","Dcond","F1cond","F2cond","F3cond","Bearing",null,null,null,"dx","call","locator","nr. QSO's","total km's"]
[null,null,null,"P",0,null,"P",0,"001",null,null,null,{"$f":"IF(K12<>\"\",AK12,0)","v":0},{"$f":"(IF(E12>1,M12,0)*$M$6/2)+(IF(H12>1,M12,0)*$M$6/2)","v":0},{"$f":"IF(K12<>0,AH12,\"\")","v":""},{"$f":"IF(K12<>0,AW12,\"\")","v":""},null,false,null,0,null,null,null,0,{"$f":"$X$8/$Z$4","v":0},{"$f":"X12/$Z$4","v":0},{"$f":"(T12-$T$8)*2/$Z$4","v":0},{"$f":"SIN(Y12)*SIN(Z12)+COS(Y12)*COS(Z12)*COS(AA12)","v":1},{"$f":"ATAN(SQRT(1-AB12*AB12)/AB12)","v":0},{"$f":"IF(AC12<0,180/$Z$4+AC12,AC12)","v":0},{"$f":"IF(Y12<>Z12,90*(1+ABS(Y12-Z12)/(Y12-Z12)))","v":false},{"$f":"IF(AA12<>0,90+$Z$4*ATAN((SIN(Y12)*AB12-SIN(Z12))/(SIN(AA12)*COS(Y12)^2)),AE12*1)","v":0},{"$f":"IF(SIN(AA12)<0,AF12+180,AF12*1)","v":0},{"$f":"INT(AG12)","v":0},null,{"$f":"6365.11*AD12","v":0},{"$f":"IF(AJ12<5,5,INT(AJ12+0.5))","v":5},null,null,{"$f":"X12/$Z$4","v":0},{"$f":"$X$8/$Z$4","v":0},{"$f":"($T$8-T12)*2/$Z$4","v":0},{"$f":"SIN(AN12)*SIN(AO12)+COS(AN12)*COS(AO12)*COS(AP12)","v":1},{"$f":"ATAN(SQRT(1-AQ12*AQ12)/AQ12)","v":0},{"$f":"IF(AC12<0,180/$Z$4+AC12,AC12)","v":0},{"$f":"IF(AN12<>AO12,90*(1+ABS(AN12-AO12)/(AN12-AO12)))","v":false},{"$f":"IF(AP12<>0,90+$Z$4*ATAN((SIN(AN12)*AQ12-SIN(AO12))/(SIN(AP12)*COS(AN12)^2)),AT12*1)","v":0},{"$f":"IF(SIN(AP12)<0,AU12+180,AU12*1)","v":0},{"$f":"INT(AV12)","v":0},null,null,null,{"$f":"M12","v":0},{"$f":"C12","v":0},{"$f":"K12","v":0},0,0]
[null,null,null,"P",0,null,"P",0,"002",null,null,null,{"$f":"IF(K13<>\"\",AK13,0)","v":0},{"$f":"(IF(E13>1,M13,0)*$M$6/2)+(IF(H13>1,M13,0)*$M$6/2)","v":0},"","",null,false,null,0,null,null,null,0,0,0,0,1,0,0,false,0,0,0,null,0,5,null,null,0,0,0,1,0,0,false,0,0,0,null,null,null,{"$f":"M13","v":0},{"$f":"C13","v":0},{"$f":"K13","v":0}]
[null,null,null,"P",0,null,"P",0,"003",null,null,null,0,0,"","",null,false,null,0,null,null,null,0,0,0,0,1,0,0,false,0,0,0,null,0,5,null,null,0,0,0,1,0,0,false,0,0,0,null,null,null,0,0,0]
[null,null,null,"P",0,null,"P",0,"004",null,null,null,0,0,"","",null,false,null,0,null,null,null,0,0,0,0,1,0,0,false,0,0,0,null,0,5,null,null,0,0,0,1,0,0,false,0,0,0,null,null,null,0,0,0]
[null,null,null,"P",0,null,"P",0,"005",null,null,null,0,0,"","",null,false,null,0,null,null,null,0,0,0,0,1,0,0,false,0,0,0,null,0,5,null,null,0,0,0,1,0,0,false,0,0,0,null,null,null,0,0,0]
[null,null,null,"P",0,null,"P",0,"006",null,null,null,0,0,"","",null,false,null,0,null,null,null,0,0,0,0,1,0,0,false,0,0,0,null,0,5,null,null,0,0,0,1,0,0,false,0,0,0,null,null,null,0,0,0]
[null,null,null,"P",0,null,"P",0,"007",null,null,null,0,0,"","",null,false,null,0,null,null,null,0,0,0,0,1,0,0,false,0,0,0,null,0,5,null,null,0,0,0,1,0,0,false,0,0,0,null,null,null,0,0,0]
[null,null,null,"P",0,null,"P",0,"008",null,null,null,0,0,"","",null,false,null,0,null,null,null,0,0,0,0,1,0,0,false,0,0,0,null,0,5,null,null,0,0,0,1,0,0,false,0,0,0,null,null,null,0,0,0]
[null,null,null,"P",0,null,"P",0,"009",null,null,null,0,0,"","",null,false,null,0,null,null,null,0,0,0,0,1,0,0,false,0,0,0,null,0,5,null,null,0,0,0,1,0,0,false,0,0,0,null,null,null,0,0,0]
[null,null,null,"P",0,null,"P",0,"010",null,null,null,0,0,"","",null,false,null,0,null,null,null,0,0,0,0,1,0,0,false,0,0,0,null,0,5,null,null,0,0,0,1,0,0,false,0,0,0,null,null,null,0,0,0]
[null,null,null,"P",0,null,"P",0,"011",null,null,null,0,0,"","",null,false,null,0,null,null,null,0,0,0,0,1,0,0,false,0,0,0,null,0,5,null,null,0,0,0,1,0,0,false,0,0,0,null,null,null,0,0,0]
[null,null,null,"P",0,null,"P",0,"012",null,null,null,0,0,"","",null,false,null,0,null,null,null,0,0,0,0,1,0,0,false,0,0,0,null,0,5,null,null,0,0,0,1,0,0,false,0,0,0,null,null,null,0,0,0]
[null,null,null,"P",0,null,"P",0,"013",null,null,null,0,0,"","",null,false,null,0,null,null,null,0,0,0,0,1,0,0,false,0,0,0,null,0,5,null,null,0,0,0,1,0,0,false,0,0,0,null,null,null,0,0,0]
[null,null,null,"P",0,null,"P",0,"014",null,null,null,0,0,"","",null,false,null,0,null,null,null,0,0,0,0,1,0,0,false,0,0,0,null,0,5,null,null,0,0,0,1,0,0,false,0,0,0,null,null,null,0,0,0]
[null,null,null,"P",0,null,"P",0,"015",null,null,null,0,0,"","",null,false,null,0,null,null,null,0,0,{"$f":"X26/$Z$4","v":0},{"$f":"(T26-$T$8)*2/$Z$4","v":0},{"$f":"SIN(Y26)*SIN(Z26)+COS(Y26)*COS(Z26)*COS(AA26)","v":1},0,0,{"$f":"IF(Y26<>Z26,90*(1+ABS(Y26-Z26)/(Y26-Z26)))","v":false},{"$f":"IF(AA26<>0,90+$Z$4*ATAN((SIN(Y26)*AB26-SIN(Z26))/(SIN(AA26)*COS(Y26)^2)),AE26*1)","v":0},{"$f":"IF(SIN(AA26)<0,AF26+180,AF26*1)","v":0},0,null,{"$f":"6365.11*AD26","v":0},5,null,null,{"$f":"X26/$Z$4","v":0},0,{"$f":"($T$8-T26)*2/$Z$4","v":0},{"$f":"SIN(AN26)*SIN(AO26)+COS(AN26)*COS(AO26)*COS(AP26)","v":1},0,{"$f":"IF(AC26<0,180/$Z$4+AC26,AC26)","v":0},{"$f":"IF(AN26<>AO26,90*(1+ABS(AN26-AO26)/(AN26-AO26)))","v":false},{"$f":"IF(AP26<>0,90+$Z$4*ATAN((SIN(AN26)*AQ26-SIN(AO26))/(SIN(AP26)*COS(AN26)^2)),AT26*1)","v":0},{"$f":"IF(SIN(AP26)<0,AU26+180,AU26*1)","v":0},0,null,null,null,0,0,0]
[null,null,null,"P",0,null,"P",0,"016",null,null,null,0,0,"","",null,false,null,0,null,null,null,0,0,0,0,1,0,0,false,0,0,0,null,0,5,null,null,0,0,0,1,0,0,false,0,0,0,null,null,null,0,0,0]
[null,null,null,"P",0,null,"P",0,"017",null,null,null,0,0,"","",null,false,null,0,null,null,null,0,0,0,0,1,0,0,false,0,0,0,null,0,5,null,null,0,0,0,1,0,0,false,0,0,0,null,null,null,0,0,0]
[null,null,null,"P",0,null,"P",0,"018",null,null,null,0,0,"","",null,false,null,0,null,null,null,0,0,0,0,1,0,0,false,0,0,0,null,0,5,null,null,0,0,0,1,0,0,false,0,0,0,null,null,null,0,0,0]
[null,null,null,"P",0,null,"P",0,"019",null,null,null,0,0,"","",null,false,null,0,null,null,null,0,0,0,0,1,0,0,false,0,0,0,null,0,5,null,null,0,0,0,1,0,0,false,0,0,0,null,null,null,0,0,0]
[null,null,null,"P",0,null,"P",0,"020",null,null,null,0,0,"","",null,false,null,0,null,null,null,0,0,0,0,1,0,0,false,0,0,0,null,0,5,null,null,0,0,0,1,0,0,false,0,0,0,null,null,null,0,0,0]
[null,null,null,"P",0,null,"P",0,"021",null,null,null,0,0,"","",null,false,null,0,null,null,null,0,0,0,0,1,0,0,false,0,0,0,null,0,5,null,null,0,0,0,1,0,0,false,0,0,0,null,null,null,0,0,0]
[null,null,null,"P",0,null,"P",0,"022",null,null,null,0,0,"","",null,false,null,0,null,null,null,0,0,0,0,1,0,0,false,0,0,0,null,0,5,null,null,0,0,0,1,0,0,false,0,0,0,null,null,null,0,0,0]
[null,null,null,"P",0,null,"P",0,"023",null,null,null,0,0,"","",null,false,null,0,null,null,null,0,0,0,0,1,0,0,false,0,0,0,null,0,5,null,null,0,0,0,1,0,0,false,0,0,0,null,null,null,0,0,0]
[null,null,null,"P",0,null,"P",0,"024",null,null,null,0,0,"","",null,false,null,0,null,null,null,0,0,0,0,1,0,0,false,0,0,0,null,0,5,null,null,0,0,0,1,0,0,false,0,0,0,null,null,null,0,0,0]
[null,null,null,"P",0,null,"P",0,"025",null,null,null,0,0,"","",null,false,null,0,null,null,null,0,0,{"$f":"X36/$Z$4","v":0},{"$f":"(T36-$T$8)*2/$Z$4","v":0},{"$f":"SIN(Y36)*SIN(Z36)+COS(Y36)*COS(Z36)*COS(AA36)","v":1},0,0,{"$f":"IF(Y36<>Z36,90*(1+ABS(Y36-Z36)/(Y36-Z36)))","v":false},{"$f":"IF(AA36<>0,90+$Z$4*ATAN((SIN(Y36)*AB36-SIN(Z36))/(SIN(AA36)*COS(Y36)^2)),AE36*1)","v":0},{"$f":"IF(SIN(AA36)<0,AF36+180,AF36*1)","v":0},0,null,{"$f":"6365.11*AD36","v":0},5,null,null,{"$f":"X36/$Z$4","v":0},0,{"$f":"($T$8-T36)*2/$Z$4","v":0},{"$f":"SIN(AN36)*SIN(AO36)+COS(AN36)*COS(AO36)*COS(AP36)","v":1},0,{"$f":"IF(AC36<0,180/$Z$4+AC36,AC36)","v":0},{"$f":"IF(AN36<>AO36,90*(1+ABS(AN36-AO36)/(AN36-AO36)))","v":false},{"$f":"IF(AP36<>0,90+$Z$4*ATAN((SIN(AN36)*AQ36-SIN(AO36))/(SIN(AP36)*COS(AN36)^2)),AT36*1)","v":0},{"$f":"IF(SIN(AP36)<0,AU36+180,AU36*1)","v":0},0,null,null,null,0,0,0]
[null,null,null,"P",0,null,"P",0,"026",null,null,null,0,0,"","",null,false,null,0,null,null,null,0,0,0,0,1,0,0,false,0,0,0,null,0,5,null,null,0,0,0,1,0,0,false,0,0,0,null,null,null,{"$f":"M37","v":0},{"$f":"C37","v":0},{"$f":"K37","v":0}]
[null,null,null,"P",0,null,"P",0,"027",null,null,null,0,0,"","",null,false,null,0,null,null,null,0,0,0,0,1,0,0,false,0,0,0,null,0,5,null,null,0,0,0,1,0,0,false,0,0,0,null,null,null,{"$f":"M38","v":0},{"$f":"C38","v":0},{"$f":"K38","v":0}]
[null,null,null,"P",0,null,"P",0,"028",null,null,null,0,0,"","",null,false,null,0,null,null,null,0,0,0,0,1,0,0,false,0,0,0,null,0,5,null,null,0,0,0,1,0,0,false,0,0,0,null,null,null,{"$f":"M39","v":0},{"$f":"C39","v":0},{"$f":"K39","v":0}]
[null,null,null,"P",0,null,"P",0,"029",null,null,null,0,0,"","",null,false,null,0,null,null,null,0,0,0,0,1,0,0,false,0,0,0,null,0,5,null,null,0,0,0,1,0,0,false,0,0,0,null,null,null,{"$f":"M40","v":0},{"$f":"C40","v":0},{"$f":"K40","v":0}]
[null,null,null,"P",0,null,"P",0,"030",null,null,null,0,0,"","",null,false,null,0,null,null,null,0,0,0,0,1,0,0,false,0,0,0,null,0,5,null,null,0,0,0,1,0,0,false,0,0,0,null,null,null,{"$f":"M41","v":0},{"$f":"C41","v":0},{"$f":"K41","v":0}]
[null,null,null,"P",0,null,"P",0,"031",null,null,null,0,0,"","",null,false,null,0,null,null,null,0,0,{"$f":"X42/$Z$4","v":0},{"$f":"(T42-$T$8)*2/$Z$4","v":0},{"$f":"SIN(Y42)*SIN(Z42)+COS(Y42)*COS(Z42)*COS(AA42)","v":1},0,0,{"$f":"IF(Y42<>Z42,90*(1+ABS(Y42-Z42)/(Y42-Z42)))","v":false},{"$f":"IF(AA42<>0,90+$Z$4*ATAN((SIN(Y42)*AB42-SIN(Z42))/(SIN(AA42)*COS(Y42)^2)),AE42*1)","v":0},{"$f":"IF(SIN(AA42)<0,AF42+180,AF42*1)","v":0},0,null,{"$f":"6365.11*AD42","v":0},5,null,null,{"$f":"X42/$Z$4","v":0},0,{"$f":"($T$8-T42)*2/$Z$4","v":0},{"$f":"SIN(AN42)*SIN(AO42)+COS(AN42)*COS(AO42)*COS(AP42)","v":1},0,{"$f":"IF(AC42<0,180/$Z$4+AC42,AC42)","v":0},{"$f":"IF(AN42<>AO42,90*(1+ABS(AN42-AO42)/(AN42-AO42)))","v":false},{"$f":"IF(AP42<>0,90+$Z$4*ATAN((SIN(AN42)*AQ42-SIN(AO42))/(SIN(AP42)*COS(AN42)^2)),AT42*1)","v":0},{"$f":"IF(SIN(AP42)<0,AU42+180,AU42*1)","v":0},0,null,null,null,{"$f":"M42","v":0},{"$f":"C42","v":0},{"$f":"K42","v":0}]
[null,null,null,"P",0,null,"P",0,"032",null,null,null,0,0,"","",null,false,null,0,null,null,null,0,0,0,0,1,0,0,false,0,0,0,null,0,5,null,null,0,0,0,1,0,0,false,0,0,0,null,null,null,0,0,0]
[null,null,null,"P",0,null,"P",0,"033",null,null,null,0,0,"","",null,false,null,0,null,null,null,0,0,0,0,1,0,0,false,0,0,0,null,0,5,null,null,0,0,0,1,0,0,false,0,0,0,null,null,null,0,0,0]
[null,null,null,"P",0,null,"P",0,"034",null,null,null,0,0,"","",null,false,null,0,null,null,null,0,0,0,0,1,0,0,false,0,0,0,null,0,5,null,null,0,0,0,1,0,0,false,0,0,0,null,null,null,0,0,0]
[null,null,null,"P",0,null,"P",0,"035",null,null,null,0,0,"","",null,false,null,0,null,null,null,0,0,0,0,1,0,0,false,0,0,0,null,0,5,null,null,0,0,0,1,0,0,false,0,0,0,null,null,null,0,0,0]
[null,null,null,"P",0,null,"P",0,"036",null,null,null,0,0,"","",null,false,null,0,null,null,null,0,0,0,0,1,0,0,false,0,0,0,null,0,5,null,null,0,0,0,1,0,0,false,0,0,0,null,null,null,0,0,0]
[null,null,null,"P",0,null,"P",0,"037",null,null,null,0,0,"","",null,false,null,0,null,null,null,0,0,0,0,1,0,0,false,0,0,0,null,0,5,null,null,0,0,0,1,0,0,false,0,0,0,null,null,null,0,0,0]
[null,null,null,"P",0,null,"P",0,"038",null,null,null,0,0,"","",null,false,null,0,null,null,null,0,0,0,0,1,0,0,false,0,0,0,null,0,5,null,null,0,0,0,1,0,0,false,0,0,0,null,null,null,0,0,0]
[null,null,null,"P",0,null,"P",0,"039",null,null,null,0,0,"","",null,false,null,0,null,null,null,0,0,0,0,1,0,0,false,0,0,0,null,0,5,null,null,0,0,0,1,0,0,false,0,0,0,null,null,null,0,0,0]
[null,null,null,"P",0,null,"P",0,"040",null,null,null,0,0,"","",null,false,null,0,null,null,null,0,0,0,0,1,0,0,false,0,0,0,null,0,5,null,null,0,0,0,1,0,0,false,0,0,0,null,null,null,0,0,0]
[null,null,null,"P",0,null,"P",0,"041",null,null,null,0,0,"","",null,false,null,0,null,null,null,0,0,0,0,1,0,0,false,0,0,0,null,0,5,null,null,0,0,0,1,0,0,false,0,0,0,null,null,null,0,0,0]
[null,null,null,"P",0,null,"P",0,"042",null,null,null,0,0,"","",null,false,null,0,null,null,null,0,0,0,0,1,0,0,false,0,0,0,null,0,5,null,null,0,0,0,1,0,0,false,0,0,0,null,null,null,0,0,0]
[null,null,null,"P",0,null,"P",0,"043",null,null,null,0,0,"","",null,false,null,0,null,null,null,0,0,0,0,1,0,0,false,0,0,0,null,0,5,null,null,0,0,0,1,0,0,false,0,0,0,null,null,null,0,0,0]
[null,null,null,"P",0,null,"P",0,"044",null,null,null,0,0,"","",null,false,null,0,null,null,null,0,0,0,0,1,0,0,false,0,0,0,null,0,5,null,null,0,0,0,1,0,0,false,0,0,0,null,null,null,0,0,0]
[null,null,null,"P",0,null,"P",0,"045",null,null,null,0,0,"","",null,false,null,0,null,null,null,0,0,0,0,1,0,0,false,0,0,0,null,0,5,null,null,0,0,0,1,0,0,false,0,0,0,null,null,null,0,0,0]
[null,null,null,"P",0,null,"P",0,"046",null,null,null,0,0,"","",null,false,null,0,null,null,null,0,0,0,0,1,0,0,false,0,0,0,null,0,5,null,null,0,0,0,1,0,0,false,0,0,0,null,null,null,0,0,0]
[null,null,null,"P",0,null,"P",0,"047",null,null,null,0,0,"","",null,false,null,0,null,null,null,0,0,0,0,1,0,0,false,0,0,0,null,0,5,null,null,0,0,0,1,0,0,false,0,0,0,null,null,null,0,0,0]
[null,null,null,"P",0,null,"P",0,"048",null,null,null,0,0,"","",null,false,null,0,null,null,null,0,0,0,0,1,0,0,false,0,0,0,null,0,5,null,null,0,0,0,1,0,0,false,0,0,0,null,null,null,0,0,0]
[null,null,null,"P",0,null,"P",0,"049",null,null,null,0,0,"","",null,false,null,0,null,null,null,0,0,0,0,1,0,0,false,0,0,0,null,0,5,null,null,0,0,0,1,0,0,false,0,0,0,null,null,null,0,0,0]
[null,null,null,"P",0,null,"P",0,"050",null,null,null,0,0,"","",null,false,null,0,null,null,null,0,0,0,0,1,0,0,false,0,0,0,null,0,5,null,null,0,0,0,1,0,0,false,0,0,0,null,null,null,0,0,0]
[null,null,null,null,null,null,null,null,null,null,null,null,null,null,null,null,null,null,null,null,null,null,null,null,null,null,null,null,null,null,null,null,null,null,null,null,null,null,null,null,null,null,null,null,null,null,null,null,null,null,null,null,null,null,null,0]

{"sheet":"1.2cm","index":11,"n_rows":62,"n_cols":57,"rows_kept":62,"cut":false,"hidden":false,"merged":[[7,2,7,3],[7,9,7,10],[3,6,3,8],[0,0,0,16],[7,7,7,8],[9,16,10,16],[9,1,10,1],[9,2,10,2],[9,3,10,5],[9,6,10,8],[9,9,10,9],[9,10,10,10],[9,11,10,11],[9,12,10,12],[9,13,10,13],[9,14,10,14],[9,15,10,15],[9,0,10,0],[5,2,5,7]]}
["ATV CONTEST LOG 1.2 cm"]
[]
[]
[null,null,null,null,null,null,null,null,null,null,null,{"$f":"IF(Summary!$V$3=1,\"Banda:\",\"Band:\")","v":"Banda:"},1.2,"cm",{"$f":"IF(Summary!$V$3=1,\"Analogico:\",\"Analogic\")","v":"Analogico:"},{"$f":"SUMIF($R$12:$R$61,\"=FALSO\",$N$12:$N$61)","v":0},null,null,null,null,null,null,null,null,"Deg/Rad :",{"$f":"180/PI()","v":57.295779513082323}]
[]
[{"$f":"IF(Summary!$V$3=1,\"Data:\",\"Date:\")","v":"Data:"},null,{"$f":"IF(Summary!B3=\"\",\"\",Summary!B3)","v":"2022-07-10"},null,null,null,null,null,null,null,null,{"$f":"IF(Summary!$V$3=1,\"Moltiplicatore:\",\"Multiplier:\")","v":"Moltiplicatore:"},{"$f":"Summary!$AI$46","v":10},null,{"$f":"IF(Summary!$V$3=1,\"Totale:\",\"Total:\")","v":"Totale:"},{"$f":"SUM(N12:N61)","v":0},{"$f":"IF(M4=70,1,IF(M4=24,2,IF(M4=23,2,IF(M4=13,5))))","v":false},{"$f":"IF(M4=9,\"5\",IF(M4=6,\"5\",IF(M4=3,\"5\",IF(M4=1.3,\"5\"))))","v":false},{"$f":"IF(M4=1.2,\"5\",IF(M4=0.6,\"5\",IF(M4=0.7,\"5\")))","v":"5"},"Longitude",null,null,null,"Latitude"]
[]
[{"$f":"IF(Summary!$V$3=1,\"Codice:\",\"Code:\")","v":"Codice:"},null,{"$f":"Summary!$B$29","v":0},null,null,null,null,{"$f":"IF(Summary!$V$3=1,\"Nominativo:\",\"Call:\")","v":"Nominativo:"},null,{"$f":"Summary!B5","v":0},null,{"$f":"IF(Summary!$V$3=1,\"Locatore WW:\",\"WW Locator:\")","v":"Locatore WW:"},{"$f":"Summary!B15","v":0},null,{"$f":"IF(Summary!$V$3=1,\"Digitale:\",\"Digital:\")","v":"Digitale:"},{"$f":"SUMIF($R$12:$R$61,\"=VERO\",$N$12:$N$61)","v":0},null,null,null,0,null,null,null,0]
[]
[{"$f":"IF(Summary!$V$3=1,\"Data\",\"Date\")","v":"Data"},{"$f":"IF(Summary!$V$3=1,\"Ora UTC\",\"Time UTC\")","v":"Ora UTC"},{"$f":"IF(Summary!$V$3=1,\"Stazioni Collegate\",\"Stations Worked\")","v":"Stazioni Collegate"},{"$f":"IF(Summary!$V$3=1,\"Rprt.+ Sequenza Ricevuta\",\"Rprt.+ Sequence Received\")","v":"Rprt.+ Sequenza Ricevuta"},null,null,{"$f":"IF(Summary!$V$3=1,\"Rpt.+ Sequenza Inviata\",\"Rpt.+ Sequence Sent\")","v":"Rpt.+ Sequenza Inviata"},null,null,{"$f":"IF(Summary!$V$3=1,\"Codice Ricevuto\",\"Code Received\")","v":"Codice Ricevuto"},{"$f":"IF(Summary!$V$3=1,\"Locatore WW\",\"WW Locator\")","v":"Locatore WW"},{"$f":"IF(Summary!$V$3=1,\"Commenti\",\"Comments\")","v":"Commenti"},{"$f":"IF(Summary!$V$3=1,\"Distanza Km\",\"Distance Km\")","v":"Distanza Km"},{"$f":"IF(Summary!$V$3=1,\"Punti\",\"Points\")","v":"Punti"},{"$f":"IF(Summary!$V$3=1,\"AZIMUT (Tuo)\",\"Heading (own)\")","v":"AZIMUT (Tuo)"},{"$f":"IF(Summary!$V$3=1,\"AZIMUT (Corrispondente)\",\"Heading (Other)\")","v":"AZIMUT (Corrispondente)"},{"$f":"IF(Summary!$V$3=1,\"DIGITALE?\",\"DIGITAL?\")","v":"DIGITALE?"},null,null,null,null,null,null,null,"Local Lat","Dist Lat","Diff Long",null,"Path Rad",null,null,null,null,null,null,null,null,null,null,"Dist Lat","Local Lat","Diff Long",null,"Path Rad",null,null,null,null,"Back"]
[null,null,null,null,null,null,null,null,null,null,null,null,null,null,null,null,null,null,null,"Longitude",null,null,null,"Latitude","A","B","L","E","D","Dcond","F1cond","F2cond","F3cond","Bearing",null,"R","Rint   km",null,null,"A","B","L","E","D","Dcond","F1cond","F2cond","F3cond","Bearing",null,null,null,"dx","call","locator","nr. QSO's","total km's"]
[null,null,null,"P",0,null,"P",0,"001",null,null,null,{"$f":"IF(K12<>\"\",AK12,0)","v":0},{"$f":"(IF(E12>1,M12,0)*$M$6/2)+(IF(H12>1,M12,0)*$M$6/2)","v":0},{"$f":"IF(K12<>0,AH12,\"\")","v":""},{"$f":"IF(K12<>0,AW12,\"\")","v":""},null,false,null,0,null,null,null,0,{"$f":"$X$8/$Z$4","v":0},{"$f":"X12/$Z$4","v":0},{"$f":"(T12-$T$8)*2/$Z$4","v":0},{"$f":"SIN(Y12)*SIN(Z12)+COS(Y12)*COS(Z12)*COS(AA12)","v":1},{"$f":"ATAN(SQRT(1-AB12*AB12)/AB12)","v":0},{"$f":"IF(AC12<0,180/$Z$4+AC12,AC12)","v":0},{"$f":"IF(Y12<>Z12,90*(1+ABS(Y12-Z12)/(Y12-Z12)))","v":false},{"$f":"IF(AA12<>0,90+$Z$4*ATAN((SIN(Y12)*AB12-SIN(Z12))/(SIN(AA12)*COS(Y12)^2)),AE12*1)","v":0},{"$f":"IF(SIN(AA12)<0,AF12+180,AF12*1)","v":0},{"$f":"INT(AG12)","v":0},null,{"$f":"6365.11*AD12","v":0},{"$f":"IF(AJ12<5,5,INT(AJ12+0.5))","v":5},null,null,{"$f":"X12/$Z$4","v":0},{"$f":"$X$8/$Z$4","v":0},{"$f":"($T$8-T12)*2/$Z$4","v":0},{"$f":"SIN(AN12)*SIN(AO12)+COS(AN12)*COS(AO12)*COS(AP12)","v":1},{"$f":"ATAN(SQRT(1-AQ12*AQ12)/AQ12)","v":0},{"$f":"IF(AC12<0,180/$Z$4+AC12,AC12)","v":0},{"$f":"IF(AN12<>AO12,90*(1+ABS(AN12-AO12)/(AN12-AO12)))","v":false},{"$f":"IF(AP12<>0,90+$Z$4*ATAN((SIN(AN12)*AQ12-SIN(AO12))/(SIN(AP12)*COS(AN12)^2)),AT12*1)","v":0},{"$f":"IF(SIN(AP12)<0,AU12+180,AU12*1)","v":0},{"$f":"INT(AV12)","v":0},null,null,null,{"$f":"M12","v":0},{"$f":"C12","v":0},{"$f":"K12","v":0},0,0]
[null,null,null,"P",0,null,"P",0,"002",null,null,null,{"$f":"IF(K13<>\"\",AK13,0)","v":0},{"$f":"(IF(E13>1,M13,0)*$M$6/2)+(IF(H13>1,M13,0)*$M$6/2)","v":0},"","",null,false,null,0,null,null,null,0,0,0,0,1,0,0,false,0,0,0,null,0,5,null,null,0,0,0,1,0,0,false,0,0,0,null,null,null,0,0,0]
[null,null,null,"P",0,null,"P",0,"003",null,null,null,0,0,"","",null,false,null,0,null,null,null,0,0,0,0,1,0,0,false,0,0,0,null,0,5,null,null,0,0,0,1,0,0,false,0,0,0,null,null,null,0,0,0]
[null,null,null,"P",0,null,"P",0,"004",null,null,null,0,0,"","",null,false,null,0,null,null,null,0,0,0,0,1,0,0,false,0,0,0,null,0,5,null,null,0,0,0,1,0,0,false,0,0,0,null,null,null,0,0,0]
[null,null,null,"P",0,null,"P",0,"005",null,null,null,0,0,"","",null,false,null,0,null,null,null,0,0,0,0,1,0,0,false,0,0,0,null,0,5,null,null,0,0,0,1,0,0,false,0,0,0,null,null,null,0,0,0]
[null,null,null,"P",0,null,"P",0,"006",null,null,null,0,0,"","",null,false,null,0,null,null,null,0,0,0,0,1,0,0,false,0,0,0,null,0,5,null,null,0,0,0,1,0,0,false,0,0,0,null,null,null,0,0,0]
[null,null,null,"P",0,null,"P",0,"007",null,null,null,0,0,"","",null,false,null,0,null,null,null,0,0,0,0,1,0,0,false,0,0,0,null,0,5,null,null,0,0,0,1,0,0,false,0,0,0,null,null,null,0,0,0]
[null,null,null,"P",0,null,"P",0,"008",null,null,null,0,0,"","",null,false,null,0,null,null,null,0,0,0,0,1,0,0,false,0,0,0,null,0,5,null,null,0,0,0,1,0,0,false,0,0,0,null,null,null,0,0,0]
[null,null,null,"P",0,null,"P",0,"009",null,null,null,0,0,"","",null,false,null,0,null,null,null,0,0,0,0,1,0,0,false,0,0,0,null,0,5,null,null,0,0,0,1,0,0,false,0,0,0,null,null,null,0,0,0]
[null,null,null,"P",0,null,"P",0,"010",null,null,null,0,0,"","",null,false,null,0,null,null,null,0,0,0,0,1,0,0,false,0,0,0,null,0,5,null,null,0,0,0,1,0,0,false,0,0,0,null,null,null,0,0,0]
[null,null,null,"P",0,null,"P",0,"011",null,null,null,0,0,"","",null,false,null,0,null,null,null,0,0,0,0,1,0,0,false,0,0,0,null,0,5,null,null,0,0,0,1,0,0,false,0,0,0,null,null,null,0,0,0]
[null,null,null,"P",0,null,"P",0,"012",null,null,null,0,0,"","",null,false,null,0,null,null,null,0,0,0,0,1,0,0,false,0,0,0,null,0,5,null,null,0,0,0,1,0,0,false,0,0,0,null,null,null,0,0,0]
[null,null,null,"P",0,null,"P",0,"013",null,null,null,0,0,"","",null,false,null,0,null,null,null,0,0,0,0,1,0,0,false,0,0,0,null,0,5,null,null,0,0,0,1,0,0,false,0,0,0,null,null,null,0,0,0]
[null,null,null,"P",0,null,"P",0,"014",null,null,null,0,0,"","",null,false,null,0,null,null,null,0,0,0,0,1,0,0,false,0,0,0,null,0,5,null,null,0,0,0,1,0,0,false,0,0,0,null,null,null,0,0,0]
[null,null,null,"P",0,null,"P",0,"015",null,null,null,0,0,"","",null,false,null,0,null,null,null,0,0,0,0,1,0,0,false,0,0,0,null,0,5,null,null,0,0,0,1,0,0,false,0,0,0,null,null,null,0,0,0]
[null,null,null,"P",0,null,"P",0,"016",null,null,null,0,0,"","",null,false,null,0,null,null,null,0,0,0,0,1,0,0,false,0,0,0,null,0,5,null,null,0,0,0,1,0,0,false,0,0,0,null,null,null,0,0,0]
[null,null,null,"P",0,null,"P",0,"017",null,null,null,0,0,"","",null,false,null,0,null,null,null,0,0,0,0,1,0,0,false,0,0,0,null,0,5,null,null,0,0,0,1,0,0,false,0,0,0,null,null,null,0,0,0]
[null,null,null,"P",0,null,"P",0,"018",null,null,null,0,0,"","",null,false,null,0,null,null,null,0,0,0,0,1,0,0,false,0,0,0,null,0,5,null,null,0,0,0,1,0,0,false,0,0,0,null,null,null,0,0,0]
[null,null,null,"P",0,null,"P",0,"019",null,null,null,0,0,"","",null,false,null,0,null,null,null,0,0,0,0,1,0,0,false,0,0,0,null,0,5,null,null,0,0,0,1,0,0,false,0,0,0,null,null,null,0,0,0]
[null,null,null,"P",0,null,"P",0,"020",null,null,null,0,0,"","",null,false,null,0,null,null,null,0,0,0,0,1,0,0,false,0,0,0,null,0,5,null,null,0,0,0,1,0,0,false,0,0,0,null,null,null,0,0,0]
[null,null,null,"P",0,null,"P",0,"021",null,null,null,0,0,"","",null,false,null,0,null,null,null,0,0,0,0,1,0,0,false,0,0,0,null,0,5,null,null,0,0,0,1,0,0,false,0,0,0,null,null,null,0,0,0]
[null,null,null,"P",0,null,"P",0,"022",null,null,null,0,0,"","",null,false,null,0,null,null,null,0,0,0,0,1,0,0,false,0,0,0,null,0,5,null,null,0,0,0,1,0,0,false,0,0,0,null,null,null,0,0,0]
[null,null,null,"P",0,null,"P",0,"023",null,null,null,0,0,"","",null,false,null,0,null,null,null,0,0,0,0,1,0,0,false,0,0,0,null,0,5,null,null,0,0,0,1,0,0,false,0,0,0,null,null,null,0,0,0]
[null,null,null,"P",0,null,"P",0,"024",null,null,null,0,0,"","",null,false,null,0,null,null,null,0,0,0,0,1,0,0,false,0,0,0,null,0,5,null,null,0,0,0,1,0,0,false,0,0,0,null,null,null,0,0,0]
[null,null,null,"P",0,null,"P",0,"025",null,null,null,0,0,"","",null,false,null,0,null,null,null,0,0,0,0,1,0,0,false,0,0,0,null,0,5,null,null,0,0,0,1,0,0,false,0,0,0,null,null,null,0,0,0]
[null,null,null,"P",0,null,"P",0,"026",null,null,null,0,0,"","",null,false,null,0,null,null,null,0,0,0,0,1,0,0,false,0,0,0,null,0,5,null,null,0,0,0,1,0,0,false,0,0,0,null,null,null,0,0,0]
[null,null,null,"P",0,null,"P",0,"027",null,null,null,0,0,"","",null,false,null,0,null,null,null,0,0,0,0,1,0,0,false,0,0,0,null,0,5,null,null,0,0,0,1,0,0,false,0,0,0,null,null,null,0,0,0]
[null,null,null,"P",0,null,"P",0,"028",null,null,null,0,0,"","",null,false,null,0,null,null,null,0,0,0,0,1,0,0,false,0,0,0,null,0,5,null,null,0,0,0,1,0,0,false,0,0,0,null,null,null,0,0,0]
[null,null,null,"P",0,null,"P",0,"029",null,null,null,0,0,"","",null,false,null,0,null,null,null,0,0,0,0,1,0,0,false,0,0,0,null,0,5,null,null,0,0,0,1,0,0,false,0,0,0,null,null,null,0,0,0]
[null,null,null,"P",0,null,"P",0,"030",null,null,null,0,0,"","",null,false,null,0,null,null,null,0,0,0,0,1,0,0,false,0,0,0,null,0,5,null,null,0,0,0,1,0,0,false,0,0,0,null,null,null,0,0,0]
[null,null,null,"P",0,null,"P",0,"031",null,null,null,0,0,"","",null,false,null,0,null,null,null,0,0,0,0,1,0,0,false,0,0,0,null,0,5,null,null,0,0,0,1,0,0,false,0,0,0,null,null,null,0,0,0]
[null,null,null,"P",0,null,"P",0,"032",null,null,null,0,0,"","",null,false,null,0,null,null,null,0,0,0,0,1,0,0,false,0,0,0,null,0,5,null,null,0,0,0,1,0,0,false,0,0,0,null,null,null,0,0,0]
[null,null,null,"P",0,null,"P",0,"033",null,null,null,0,0,"","",null,false,null,0,null,null,null,0,{"$f":"$X$8/$Z$4","v":0},{"$f":"X44/$Z$4","v":0},{"$f":"(T44-$T$8)*2/$Z$4","v":0},{"$f":"SIN(Y44)*SIN(Z44)+COS(Y44)*COS(Z44)*COS(AA44)","v":1},{"$f":"ATAN(SQRT(1-AB44*AB44)/AB44)","v":0},{"$f":"IF(AC44<0,180/$Z$4+AC44,AC44)","v":0},{"$f":"IF(Y44<>Z44,90*(1+ABS(Y44-Z44)/(Y44-Z44)))","v":false},{"$f":"IF(AA44<>0,90+$Z$4*ATAN((SIN(Y44)*AB44-SIN(Z44))/(SIN(AA44)*COS(Y44)^2)),AE44*1)","v":0},{"$f":"IF(SIN(AA44)<0,AF44+180,AF44*1)","v":0},{"$f":"INT(AG44)","v":0},null,{"$f":"6365.11*AD44","v":0},{"$f":"IF(AJ44<5,5,INT(AJ44+0.5))","v":5},null,null,{"$f":"X44/$Z$4","v":0},{"$f":"$X$8/$Z$4","v":0},{"$f":"($T$8-T44)*2/$Z$4","v":0},{"$f":"SIN(AN44)*SIN(AO44)+COS(AN44)*COS(AO44)*COS(AP44)","v":1},{"$f":"ATAN(SQRT(1-AQ44*AQ44)/AQ44)","v":0},{"$f":"IF(AC44<0,180/$Z$4+AC44,AC44)","v":0},{"$f":"IF(AN44<>AO44,90*(1+ABS(AN44-AO44)/(AN44-AO44)))","v":false},{"$f":"IF(AP44<>0,90+$Z$4*ATAN((SIN(AN44)*AQ44-SIN(AO44))/(SIN(AP44)*COS(AN44)^2)),AT44*1)","v":0},{"$f":"IF(SIN(AP44)<0,AU44+180,AU44*1)","v":0},{"$f":"INT(AV44)","v":0},null,null,null,{"$f":"M44","v":0},{"$f":"C44","v":0},{"$f":"K44","v":0}]
[null,null,null,"P",0,null,"P",0,"034",null,null,null,0,0,"","",null,false,null,0,null,null,null,0,0,0,0,1,0,0,false,0,0,0,null,0,5,null,null,0,0,0,1,0,0,false,0,0,0,null,null,null,0,0,0]
[null,null,null,"P",0,null,"P",0,"035",null,null,null,0,0,"","",null,false,null,0,null,null,null,0,0,0,0,1,0,0,false,0,0,0,null,0,5,null,null,0,0,0,1,0,0,false,0,0,0,null,null,null,0,0,0]
[null,null,null,"P",0,null,"P",0,"036",null,null,null,0,0,"","",null,false,null,0,null,null,null,0,0,0,0,1,0,0,false,0,0,0,null,0,5,null,null,0,0,0,1,0,0,false,0,0,0,null,null,null,0,0,0]
[null,null,null,"P",0,null,"P",0,"037",null,null,null,0,0,"","",null,false,null,0,null,null,null,0,0,0,0,1,0,0,false,0,0,0,null,0,5,null,null,0,0,0,1,0,0,false,0,0,0,null,null,null,0,0,0]
[null,null,null,"P",0,null,"P",0,"038",null,null,null,0,0,"","",null,false,null,0,null,null,null,0,0,0,0,1,0,0,false,0,0,0,null,0,5,null,null,0,0,0,1,0,0,false,0,0,0,null,null,null,0,0,0]
[null,null,null,"P",0,null,"P",0,"039",null,null,null,0,0,"","",null,false,null,0,null,null,null,0,0,0,0,1,0,0,false,0,0,0,null,0,5,null,null,0,0,0,1,0,0,false,0,0,0,null,null,null,0,0,0]
[null,null,null,"P",0,null,"P",0,"040",null,null,null,0,0,"","",null,false,null,0,null,null,null,0,0,0,0,1,0,0,false,0,0,0,null,0,5,null,null,0,0,0,1,0,0,false,0,0,0,null,null,null,0,0,0]
[null,null,null,"P",0,null,"P",0,"041",null,null,null,0,0,"","",null,false,null,0,null,null,null,0,0,0,0,1,0,0,false,0,0,0,null,0,5,null,null,0,0,0,1,0,0,false,0,0,0,null,null,null,0,0,0]
[null,null,null,"P",0,null,"P",0,"042",null,null,null,0,0,"","",null,false,null,0,null,null,null,0,0,0,0,1,0,0,false,0,0,0,null,0,5,null,null,0,0,0,1,0,0,false,0,0,0,null,null,null,0,0,0]
[null,null,null,"P",0,null,"P",0,"043",null,null,null,0,0,"","",null,false,null,0,null,null,null,0,0,0,0,1,0,0,false,0,0,0,null,0,5,null,null,0,0,0,1,0,0,false,0,0,0,null,null,null,0,0,0]
[null,null,null,"P",0,null,"P",0,"044",null,null,null,0,0,"","",null,false,null,0,null,null,null,0,0,0,0,1,0,0,false,0,0,0,null,0,5,null,null,0,0,0,1,0,0,false,0,0,0,null,null,null,0,0,0]
[null,null,null,"P",0,null,"P",0,"045",null,null,null,0,0,"","",null,false,null,0,null,null,null,0,0,0,0,1,0,0,false,0,0,0,null,0,5,null,null,0,0,0,1,0,0,false,0,0,0,null,null,null,0,0,0]
[null,null,null,"P",0,null,"P",0,"046",null,null,null,0,0,"","",null,false,null,0,null,null,null,0,0,0,0,1,0,0,false,0,0,0,null,0,5,null,null,0,0,0,1,0,0,false,0,0,0,null,null,null,0,0,0]
[null,null,null,"P",0,null,"P",0,"047",null,null,null,0,0,"","",null,false,null,0,null,null,null,0,0,0,0,1,0,0,false,0,0,0,null,0,5,null,null,0,0,0,1,0,0,false,0,0,0,null,null,null,0,0,0]
[null,null,null,"P",0,null,"P",0,"048",null,null,null,0,0,"","",null,false,null,0,null,null,null,0,0,0,0,1,0,0,false,0,0,0,null,0,5,null,null,0,0,0,1,0,0,false,0,0,0,null,null,null,0,0,0]
[null,null,null,"P",0,null,"P",0,"049",null,null,null,0,0,"","",null,false,null,0,null,null,null,0,0,0,0,1,0,0,false,0,0,0,null,0,5,null,null,0,0,0,1,0,0,false,0,0,0,null,null,null,0,0,0]
[null,null,null,"P",0,null,"P",0,"050",null,null,null,0,0,"","",null,false,null,0,null,null,null,0,0,0,0,1,0,0,false,0,0,0,null,0,5,null,null,0,0,0,1,0,0,false,0,0,0,null,null,null,0,0,0]
[null,null,null,null,null,null,null,null,null,null,null,null,null,null,null,null,null,null,null,null,null,null,null,null,null,null,null,null,null,null,null,null,null,null,null,null,null,null,null,null,null,null,null,null,null,null,null,null,null,null,null,null,null,null,null,0]

{"sheet":"0.6cm","index":12,"n_rows":62,"n_cols":57,"rows_kept":62,"cut":false,"hidden":false,"merged":[[5,2,5,7],[7,2,7,3],[7,9,7,10],[0,0,0,16],[7,7,7,8],[9,16,10,16],[9,1,10,1],[9,2,10,2],[9,3,10,5],[9,6,10,8],[9,9,10,9],[9,10,10,10],[9,11,10,11],[9,12,10,12],[9,13,10,13],[9,14,10,14],[9,15,10,15],[9,0,10,0],[3,6,3,8]]}
["ATV CONTEST LOG 0.6 cm"]
[]
[]
[null,null,null,null,null,null,null,null,null,null,null,{"$f":"IF(Summary!$V$3=1,\"Banda:\",\"Band:\")","v":"Banda:"},0.6,"cm",{"$f":"IF(Summary!$V$3=1,\"Analogico:\",\"Analogic\")","v":"Analogico:"},{"$f":"SUMIF($R$12:$R$61,\"=FALSO\",$N$12:$N$61)","v":0},null,null,null,null,null,null,null,null,"Deg/Rad :",{"$f":"180/PI()","v":57.295779513082323}]
[]
[{"$f":"IF(Summary!$V$3=1,\"Data:\",\"Date:\")","v":"Data:"},null,{"$f":"IF(Summary!B3=\"\",\"\",Summary!B3)","v":"2022-07-10"},null,null,null,null,null,null,null,null,{"$f":"IF(Summary!$V$3=1,\"Moltiplicatore:\",\"Multiplier:\")","v":"Moltiplicatore:"},{"$f":"Summary!$AI$46","v":10},null,{"$f":"IF(Summary!$V$3=1,\"Totale:\",\"Total:\")","v":"Totale:"},{"$f":"SUM(N12:N61)","v":0},{"$f":"IF(M4=70,1,IF(M4=24,2,IF(M4=23,2,IF(M4=13,5))))","v":false},{"$f":"IF(M4=9,\"5\",IF(M4=6,\"5\",IF(M4=3,\"5\",IF(M4=1.3,\"5\"))))","v":false},{"$f":"IF(M4=1.2,\"5\",IF(M4=0.6,\"5\",IF(M4=0.7,\"5\")))","v":"5"},"Longitude",null,null,null,"Latitude"]
[]
[{"$f":"IF(Summary!$V$3=1,\"Codice:\",\"Code:\")","v":"Codice:"},null,{"$f":"Summary!B30","v":0},null,null,null,null,{"$f":"IF(Summary!$V$3=1,\"Nominativo:\",\"Call:\")","v":"Nominativo:"},null,{"$f":"Summary!B5","v":0},null,{"$f":"IF(Summary!$V$3=1,\"Locatore WW:\",\"WW Locator:\")","v":"Locatore WW:"},{"$f":"Summary!B15","v":0},null,{"$f":"IF(Summary!$V$3=1,\"Digitale:\",\"Digital:\")","v":"Digitale:"},{"$f":"SUMIF($R$12:$R$61,\"=VERO\",$N$12:$N$61)","v":0},null,null,null,0,null,null,null,0]
[]
[{"$f":"IF(Summary!$V$3=1,\"Data\",\"Date\")","v":"Data"},{"$f":"IF(Summary!$V$3=1,\"Ora UTC\",\"Time UTC\")","v":"Ora UTC"},{"$f":"IF(Summary!$V$3=1,\"Stazioni Collegate\",\"Stations Worked\")","v":"Stazioni Collegate"},{"$f":"IF(Summary!$V$3=1,\"Rprt.+ Sequenza Ricevuta\",\"Rprt.+ Sequence Received\")","v":"Rprt.+ Sequenza Ricevuta"},null,null,{"$f":"IF(Summary!$V$3=1,\"Rpt.+ Sequenza Inviata\",\"Rpt.+ Sequence Sent\")","v":"Rpt.+ Sequenza Inviata"},null,null,{"$f":"IF(Summary!$V$3=1,\"Codice Ricevuto\",\"Code Received\")","v":"Codice Ricevuto"},{"$f":"IF(Summary!$V$3=1,\"Locatore WW\",\"WW Locator\")","v":"Locatore WW"},{"$f":"IF(Summary!$V$3=1,\"Commenti\",\"Comments\")","v":"Commenti"},{"$f":"IF(Summary!$V$3=1,\"Distanza Km\",\"Distance Km\")","v":"Distanza Km"},{"$f":"IF(Summary!$V$3=1,\"Punti\",\"Points\")","v":"Punti"},{"$f":"IF(Summary!$V$3=1,\"AZIMUT (Tuo)\",\"Heading (own)\")","v":"AZIMUT (Tuo)"},{"$f":"IF(Summary!$V$3=1,\"AZIMUT (Corrispondente)\",\"Heading (Other)\")","v":"AZIMUT (Corrispondente)"},{"$f":"IF(Summary!$V$3=1,\"DIGITALE?\",\"DIGITAL?\")","v":"DIGITALE?"},null,null,null,null,null,null,null,"Local Lat","Dist Lat","Diff Long",null,"Path Rad",null,null,null,null,null,null,null,null,null,null,"Dist Lat","Local Lat","Diff Long",null,"Path Rad",null,null,null,null,"Back"]
[null,null,null,null,null,null,null,null,null,null,null,null,null,null,null,null,null,null,null,"Longitude",null,null,null,"Latitude","A","B","L","E","D","Dcond","F1cond","F2cond","F3cond","Bearing",null,"R","Rint   km",null,null,"A","B","L","E","D","Dcond","F1cond","F2cond","F3cond","Bearing",null,null,null,"dx","call","locator","nr. QSO's","total km's"]
[null,null,null,"P",0,null,"P",0,"001",null,null,null,{"$f":"IF(K12<>\"\",AK12,0)","v":0},{"$f":"(IF(E12>1,M12,0)*$M$6/2)+(IF(H12>1,M12,0)*$M$6/2)","v":0},{"$f":"IF(K12<>0,AH12,\"\")","v":""},{"$f":"IF(K12<>0,AW12,\"\")","v":""},null,false,null,0,null,null,null,0,{"$f":"$X$8/$Z$4","v":0},{"$f":"X12/$Z$4","v":0},{"$f":"(T12-$T$8)*2/$Z$4","v":0},{"$f":"SIN(Y12)*SIN(Z12)+COS(Y12)*COS(Z12)*COS(AA12)","v":1},{"$f":"ATAN(SQRT(1-AB12*AB12)/AB12)","v":0},{"$f":"IF(AC12<0,180/$Z$4+AC12,AC12)","v":0},{"$f":"IF(Y12<>Z12,90*(1+ABS(Y12-Z12)/(Y12-Z12)))","v":false},{"$f":"IF(AA12<>0,90+$Z$4*ATAN((SIN(Y12)*AB12-SIN(Z12))/(SIN(AA12)*COS(Y12)^2)),AE12*1)","v":0},{"$f":"IF(SIN(AA12)<0,AF12+180,AF12*1)","v":0},{"$f":"INT(AG12)","v":0},null,{"$f":"6365.11*AD12","v":0},{"$f":"IF(AJ12<5,5,INT(AJ12+0.5))","v":5},null,null,{"$f":"X12/$Z$4","v":0},{"$f":"$X$8/$Z$4","v":0},{"$f":"($T$8-T12)*2/$Z$4","v":0},{"$f":"SIN(AN12)*SIN(AO12)+COS(AN12)*COS(AO12)*COS(AP12)","v":1},{"$f":"ATAN(SQRT(1-AQ12*AQ12)/AQ12)","v":0},{"$f":"IF(AC12<0,180/$Z$4+AC12,AC12)","v":0},{"$f":"IF(AN12<>AO12,90*(1+ABS(AN12-AO12)/(AN12-AO12)))","v":false},{"$f":"IF(AP12<>0,90+$Z$4*ATAN((SIN(AN12)*AQ12-SIN(AO12))/(SIN(AP12)*COS(AN12)^2)),AT12*1)","v":0},{"$f":"IF(SIN(AP12)<0,AU12+180,AU12*1)","v":0},{"$f":"INT(AV12)","v":0},null,null,null,{"$f":"M12","v":0},{"$f":"C12","v":0},{"$f":"K12","v":0},0,0]
[null,null,null,"P",0,null,"P",0,"002",null,null,null,{"$f":"IF(K13<>\"\",AK13,0)","v":0},{"$f":"(IF(E13>1,M13,0)*$M$6/2)+(IF(H13>1,M13,0)*$M$6/2)","v":0},"","",null,false,null,0,null,null,null,0,0,0,0,1,0,0,false,0,0,0,null,0,5,null,null,0,0,0,1,0,0,false,0,0,0,null,null,null,0,0,0]
[null,null,null,"P",0,null,"P",0,"003",null,null,null,0,0,"","",null,false,null,0,null,null,null,0,0,0,0,1,0,0,false,0,0,0,null,0,5,null,null,0,0,0,1,0,0,false,0,0,0,null,null,null,0,0,0]
[null,null,null,"P",0,null,"P",0,"004",null,null,null,0,0,"","",null,false,null,0,null,null,null,0,0,0,0,1,0,0,false,0,0,0,null,0,5,null,null,0,0,0,1,0,0,false,0,0,0,null,null,null,0,0,0]
[null,null,null,"P",0,null,"P",0,"005",null,null,null,0,0,"","",null,false,null,0,null,null,null,0,0,0,0,1,0,0,false,0,0,0,null,0,5,null,null,0,0,0,1,0,0,false,0,0,0,null,null,null,0,0,0]
[null,null,null,"P",0,null,"P",0,"006",null,null,null,0,0,"","",null,false,null,0,null,null,null,0,0,0,0,1,0,0,false,0,0,0,null,0,5,null,null,0,0,0,1,0,0,false,0,0,0,null,null,null,0,0,0]
[null,null,null,"P",0,null,"P",0,"007",null,null,null,0,0,"","",null,false,null,0,null,null,null,0,0,0,0,1,0,0,false,0,0,0,null,0,5,null,null,0,0,0,1,0,0,false,0,0,0,null,null,null,0,0,0]
[null,null,null,"P",0,null,"P",0,"008",null,null,null,0,0,"","",null,false,null,0,null,null,null,0,0,0,0,1,0,0,false,0,0,0,null,0,5,null,null,0,0,0,1,0,0,false,0,0,0,null,null,null,0,0,0]
[null,null,null,"P",0,null,"P",0,"009",null,null,null,0,0,"","",null,false,null,0,null,null,null,0,0,0,0,1,0,0,false,0,0,0,null,0,5,null,null,0,0,0,1,0,0,false,0,0,0,null,null,null,0,0,0]
[null,null,null,"P",0,null,"P",0,"010",null,null,null,0,0,"","",null,false,null,0,null,null,null,0,0,0,0,1,0,0,false,0,0,0,null,0,5,null,null,0,0,0,1,0,0,false,0,0,0,null,null,null,0,0,0]
[null,null,null,"P",0,null,"P",0,"011",null,null,null,0,0,"","",null,false,null,0,null,null,null,0,0,0,0,1,0,0,false,0,0,0,null,0,5,null,null,0,0,0,1,0,0,false,0,0,0,null,null,null,0,0,0]
[null,null,null,"P",0,null,"P",0,"012",null,null,null,0,0,"","",null,false,null,0,null,null,null,0,0,0,0,1,0,0,false,0,0,0,null,0,5,null,null,0,0,0,1,0,0,false,0,0,0,null,null,null,0,0,0]
[null,null,null,"P",0,null,"P",0,"013",null,null,null,0,0,"","",null,false,null,0,null,null,null,0,0,0,0,1,0,0,false,0,0,0,null,0,5,null,null,0,0,0,1,0,0,false,0,0,0,null,null,null,0,0,0]
[null,null,null,"P",0,null,"P",0,"014",null,null,null,0,0,"","",null,false,null,0,null,null,null,0,0,0,0,1,0,0,false,0,0,0,null,0,5,null,null,0,0,0,1,0,0,false,0,0,0,null,null,null,0,0,0]
[null,null,null,"P",0,null,"P",0,"015",null,null,null,0,0,"","",null,false,null,0,null,null,null,0,0,0,0,1,0,0,false,0,0,0,null,0,5,null,null,0,0,0,1,0,0,false,0,0,0,null,null,null,0,0,0]
[null,null,null,"P",0,null,"P",0,"016",null,null,null,0,0,"","",null,false,null,0,null,null,null,0,0,0,0,1,0,0,false,0,0,0,null,0,5,null,null,0,0,0,1,0,0,false,0,0,0,null,null,null,0,0,0]
[null,null,null,"P",0,null,"P",0,"017",null,null,null,0,0,"","",null,false,null,0,null,null,null,0,0,0,0,1,0,0,false,0,0,0,null,0,5,null,null,0,0,0,1,0,0,false,0,0,0,null,null,null,0,0,0]
[null,null,null,"P",0,null,"P",0,"018",null,null,null,0,0,"","",null,false,null,0,null,null,null,0,0,0,0,1,0,0,false,0,0,0,null,0,5,null,null,0,0,0,1,0,0,false,0,0,0,null,null,null,0,0,0]
[null,null,null,"P",0,null,"P",0,"019",null,null,null,0,0,"","",null,false,null,0,null,null,null,0,0,0,0,1,0,0,false,0,0,0,null,0,5,null,null,0,0,0,1,0,0,false,0,0,0,null,null,null,0,0,0]
[null,null,null,"P",0,null,"P",0,"020",null,null,null,0,0,"","",null,false,null,0,null,null,null,0,0,0,0,1,0,0,false,0,0,0,null,0,5,null,null,0,0,0,1,0,0,false,0,0,0,null,null,null,0,0,0]
[null,null,null,"P",0,null,"P",0,"021",null,null,null,0,0,"","",null,false,null,0,null,null,null,0,0,0,0,1,0,0,false,0,0,0,null,0,5,null,null,0,0,0,1,0,0,false,0,0,0,null,null,null,0,0,0]
[null,null,null,"P",0,null,"P",0,"022",null,null,null,0,0,"","",null,false,null,0,null,null,null,0,0,0,0,1,0,0,false,0,0,0,null,0,5,null,null,0,0,0,1,0,0,false,0,0,0,null,null,null,0,0,0]
[null,null,null,"P",0,null,"P",0,"023",null,null,null,0,0,"","",null,false,null,0,null,null,null,0,0,0,0,1,0,0,false,0,0,0,null,0,5,null,null,0,0,0,1,0,0,false,0,0,0,null,null,null,0,0,0]
[null,null,null,"P",0,null,"P",0,"024",null,null,null,0,0,"","",null,false,null,0,null,null,null,0,0,0,0,1,0,0,false,0,0,0,null,0,5,null,null,0,0,0,1,0,0,false,0,0,0,null,null,null,0,0,0]
[null,null,null,"P",0,null,"P",0,"025",null,null,null,0,0,"","",null,false,null,0,null,null,null,0,0,0,0,1,0,0,false,0,0,0,null,0,5,null,null,0,0,0,1,0,0,false,0,0,0,null,null,null,0,0,0]
[null,null,null,"P",0,null,"P",0,"026",null,null,null,0,0,"","",null,false,null,0,null,null,null,0,0,0,0,1,0,0,false,0,0,0,null,0,5,null,null,0,0,0,1,0,0,false,0,0,0,null,null,null,0,0,0]
[null,null,null,"P",0,null,"P",0,"027",null,null,null,0,0,"","",null,false,null,0,null,null,null,0,0,0,0,1,0,0,false,0,0,0,null,0,5,null,null,0,0,0,1,0,0,false,0,0,0,null,null,null,0,0,0]
[null,null,null,"P",0,null,"P",0,"028",null,null,null,0,0,"","",null,false,null,0,null,null,null,0,0,0,0,1,0,0,false,0,0,0,null,0,5,null,null,0,0,0,1,0,0,false,0,0,0,null,null,null,0,0,0]
[null,null,null,"P",0,null,"P",0,"029",null,null,null,0,0,"","",null,false,null,0,null,null,null,0,0,0,0,1,0,0,false,0,0,0,null,0,5,null,null,0,0,0,1,0,0,false,0,0,0,null,null,null,0,0,0]
[null,null,null,"P",0,null,"P",0,"030",null,null,null,0,0,"","",null,false,null,0,null,null,null,0,0,0,0,1,0,0,false,0,0,0,null,0,5,null,null,0,0,0,1,0,0,false,0,0,0,null,null,null,0,0,0]
[null,null,null,"P",0,null,"P",0,"031",null,null,null,0,0,"","",null,false,null,0,null,null,null,0,0,0,0,1,0,0,false,0,0,0,null,0,5,null,null,0,0,0,1,0,0,false,0,0,0,null,null,null,0,0,0]
[null,null,null,"P",0,null,"P",0,"032",null,null,null,0,0,"","",null,false,null,0,null,null,null,0,0,0,0,1,0,0,false,0,0,0,null,0,5,null,null,0,0,0,1,0,0,false,0,0,0,null,null,null,0,0,0]
[null,null,null,"P",0,null,"P",0,"033",null,null,null,0,0,"","",null,false,null,0,null,null,null,0,0,0,0,1,0,0,false,0,0,0,null,0,5,null,null,0,0,0,1,0,0,false,0,0,0,null,null,null,0,0,0]
[null,null,null,"P",0,null,"P",0,"034",null,null,null,0,0,"","",null,false,null,0,null,null,null,0,0,0,0,1,0,0,false,0,0,0,null,0,5,null,null,0,0,0,1,0,0,false,0,0,0,null,null,null,0,0,0]
[null,null,null,"P",0,null,"P",0,"035",null,null,null,0,0,"","",null,false,null,0,null,null,null,0,0,0,0,1,0,0,false,0,0,0,null,0,5,null,null,0,0,0,1,0,0,false,0,0,0,null,null,null,0,0,0]
[null,null,null,"P",0,null,"P",0,"036",null,null,null,0,0,"","",null,false,null,0,null,null,null,0,0,0,0,1,0,0,false,0,0,0,null,0,5,null,null,0,0,0,1,0,0,false,0,0,0,null,null,null,0,0,0]
[null,null,null,"P",0,null,"P",0,"037",null,null,null,0,0,"","",null,false,null,0,null,null,null,0,0,0,0,1,0,0,false,0,0,0,null,0,5,null,null,0,0,0,1,0,0,false,0,0,0,null,null,null,0,0,0]
[null,null,null,"P",0,null,"P",0,"038",null,null,null,0,0,"","",null,false,null,0,null,null,null,0,0,0,0,1,0,0,false,0,0,0,null,0,5,null,null,0,0,0,1,0,0,false,0,0,0,null,null,null,0,0,0]
[null,null,null,"P",0,null,"P",0,"039",null,null,null,0,0,"","",null,false,null,0,null,null,null,0,0,0,0,1,0,0,false,0,0,0,null,0,5,null,null,0,0,0,1,0,0,false,0,0,0,null,null,null,0,0,0]
[null,null,null,"P",0,null,"P",0,"040",null,null,null,0,0,"","",null,false,null,0,null,null,null,0,0,0,0,1,0,0,false,0,0,0,null,0,5,null,null,0,0,0,1,0,0,false,0,0,0,null,null,null,0,0,0]
[null,null,null,"P",0,null,"P",0,"041",null,null,null,0,0,"","",null,false,null,0,null,null,null,0,0,0,0,1,0,0,false,0,0,0,null,0,5,null,null,0,0,0,1,0,0,false,0,0,0,null,null,null,0,0,0]
[null,null,null,"P",0,null,"P",0,"042",null,null,null,0,0,"","",null,false,null,0,null,null,null,0,0,0,0,1,0,0,false,0,0,0,null,0,5,null,null,0,0,0,1,0,0,false,0,0,0,null,null,null,0,0,0]
[null,null,null,"P",0,null,"P",0,"043",null,null,null,0,0,"","",null,false,null,0,null,null,null,0,0,0,0,1,0,0,false,0,0,0,null,0,5,null,null,0,0,0,1,0,0,false,0,0,0,null,null,null,0,0,0]
[null,null,null,"P",0,null,"P",0,"044",null,null,null,0,0,"","",null,false,null,0,null,null,null,0,0,0,0,1,0,0,false,0,0,0,null,0,5,null,null,0,0,0,1,0,0,false,0,0,0,null,null,null,0,0,0]
[null,null,null,"P",0,null,"P",0,"045",null,null,null,0,0,"","",null,false,null,0,null,null,null,0,0,0,0,1,0,0,false,0,0,0,null,0,5,null,null,0,0,0,1,0,0,false,0,0,0,null,null,null,0,0,0]
[null,null,null,"P",0,null,"P",0,"046",null,null,null,0,0,"","",null,false,null,0,null,null,null,0,0,0,0,1,0,0,false,0,0,0,null,0,5,null,null,0,0,0,1,0,0,false,0,0,0,null,null,null,0,0,0]
[null,null,null,"P",0,null,"P",0,"047",null,null,null,0,0,"","",null,false,null,0,null,null,null,0,0,0,0,1,0,0,false,0,0,0,null,0,5,null,null,0,0,0,1,0,0,false,0,0,0,null,null,null,0,0,0]
[null,null,null,"P",0,null,"P",0,"048",null,null,null,0,0,"","",null,false,null,0,null,null,null,0,0,0,0,1,0,0,false,0,0,0,null,0,5,null,null,0,0,0,1,0,0,false,0,0,0,null,null,null,0,0,0]
[null,null,null,"P",0,null,"P",0,"049",null,null,null,0,0,"","",null,false,null,0,null,null,null,0,0,0,0,1,0,0,false,0,0,0,null,0,5,null,null,0,0,0,1,0,0,false,0,0,0,null,null,null,0,0,0]
[null,null,null,"P",0,null,"P",0,"050",null,null,null,0,0,"","",null,false,null,0,null,null,null,0,0,0,0,1,0,0,false,0,0,0,null,0,5,null,null,0,0,0,1,0,0,false,0,0,0,null,null,null,0,0,0]
[null,null,null,null,null,null,null,null,null,null,null,null,null,null,null,null,null,null,null,null,null,null,null,null,null,null,null,null,null,null,null,null,null,null,null,null,null,null,null,null,null,null,null,null,null,null,null,null,null,null,null,null,null,null,null,0]

{"sheet":"0.4cm","index":13,"n_rows":62,"n_cols":57,"rows_kept":62,"cut":false,"hidden":false,"merged":[[5,2,5,7],[7,2,7,3],[7,9,7,10],[0,0,0,16],[7,7,7,8],[9,16,10,16],[9,1,10,1],[9,2,10,2],[9,3,10,5],[9,6,10,8],[9,9,10,9],[9,10,10,10],[9,11,10,11],[9,12,10,12],[9,13,10,13],[9,14,10,14],[9,15,10,15],[9,0,10,0],[3,6,3,8]]}
["ATV CONTEST LOG 0.4 cm"]
[]
[]
[null,null,null,null,null,null,null,null,null,null,null,{"$f":"IF(Summary!$V$3=1,\"Banda:\",\"Band:\")","v":"Banda:"},0.4,"cm",{"$f":"IF(Summary!$V$3=1,\"Analogico:\",\"Analogic\")","v":"Analogico:"},{"$f":"SUMIF($R$12:$R$61,\"=FALSO\",$N$12:$N$61)","v":0},null,null,null,null,null,null,null,null,"Deg/Rad :",{"$f":"180/PI()","v":57.295779513082323}]
[]
[{"$f":"IF(Summary!$V$3=1,\"Data:\",\"Date:\")","v":"Data:"},null,{"$f":"IF(Summary!B3=\"\",\"\",Summary!B3)","v":"2022-07-10"},null,null,null,null,null,null,null,null,{"$f":"IF(Summary!$V$3=1,\"Moltiplicatore:\",\"Multiplier:\")","v":"Moltiplicatore:"},{"$f":"Summary!$AI$48","v":10},null,{"$f":"IF(Summary!$V$3=1,\"Totale:\",\"Total:\")","v":"Totale:"},{"$f":"SUM(N12:N61)","v":0},{"$f":"IF(M4=70,1,IF(M4=24,2,IF(M4=23,2,IF(M4=13,5))))","v":false},{"$f":"IF(M4=9,\"5\",IF(M4=6,\"5\",IF(M4=3,\"5\",IF(M4=1.3,\"5\"))))","v":false},{"$f":"IF(M4=1.2,\"5\",IF(M4=0.6,\"5\",IF(M4=0.7,\"5\")))","v":false},"Longitude",null,null,null,"Latitude"]
[]
[{"$f":"IF(Summary!$V$3=1,\"Codice:\",\"Code:\")","v":"Codice:"},null,{"$f":"Summary!$B$31","v":0},null,null,null,null,{"$f":"IF(Summary!$V$3=1,\"Nominativo:\",\"Call:\")","v":"Nominativo:"},null,{"$f":"Summary!B5","v":0},null,{"$f":"IF(Summary!$V$3=1,\"Locatore WW:\",\"WW Locator:\")","v":"Locatore WW:"},{"$f":"Summary!B15","v":0},null,{"$f":"IF(Summary!$V$3=1,\"Digitale:\",\"Digital:\")","v":"Digitale:"},{"$f":"SUMIF($R$12:$R$61,\"=VERO\",$N$12:$N$61)","v":0},null,null,null,0,null,null,null,0]
[]
[{"$f":"IF(Summary!$V$3=1,\"Data\",\"Date\")","v":"Data"},{"$f":"IF(Summary!$V$3=1,\"Ora UTC\",\"Time UTC\")","v":"Ora UTC"},{"$f":"IF(Summary!$V$3=1,\"Stazioni Collegate\",\"Stations Worked\")","v":"Stazioni Collegate"},{"$f":"IF(Summary!$V$3=1,\"Rprt.+ Sequenza Ricevuta\",\"Rprt.+ Sequence Received\")","v":"Rprt.+ Sequenza Ricevuta"},null,null,{"$f":"IF(Summary!$V$3=1,\"Rpt.+ Sequenza Inviata\",\"Rpt.+ Sequence Sent\")","v":"Rpt.+ Sequenza Inviata"},null,null,{"$f":"IF(Summary!$V$3=1,\"Codice Ricevuto\",\"Code Received\")","v":"Codice Ricevuto"},{"$f":"IF(Summary!$V$3=1,\"Locatore WW\",\"WW Locator\")","v":"Locatore WW"},{"$f":"IF(Summary!$V$3=1,\"Commenti\",\"Comments\")","v":"Commenti"},{"$f":"IF(Summary!$V$3=1,\"Distanza Km\",\"Distance Km\")","v":"Distanza Km"},{"$f":"IF(Summary!$V$3=1,\"Punti\",\"Points\")","v":"Punti"},{"$f":"IF(Summary!$V$3=1,\"AZIMUT (Tuo)\",\"Heading (own)\")","v":"AZIMUT (Tuo)"},{"$f":"IF(Summary!$V$3=1,\"AZIMUT (Corrispondente)\",\"Heading (Other)\")","v":"AZIMUT (Corrispondente)"},{"$f":"IF(Summary!$V$3=1,\"DIGITALE?\",\"DIGITAL?\")","v":"DIGITALE?"},null,null,null,null,null,null,null,"Local Lat","Dist Lat","Diff Long",null,"Path Rad",null,null,null,null,null,null,null,null,null,null,"Dist Lat","Local Lat","Diff Long",null,"Path Rad",null,null,null,null,"Back"]
[null,null,null,null,null,null,null,null,null,null,null,null,null,null,null,null,null,null,null,"Longitude",null,null,null,"Latitude","A","B","L","E","D","Dcond","F1cond","F2cond","F3cond","Bearing",null,"R","Rint   km",null,null,"A","B","L","E","D","Dcond","F1cond","F2cond","F3cond","Bearing",null,null,null,"dx","call","locator","nr. QSO's","total km's"]
[null,null,null,"P",0,null,"P",0,"001",null,null,null,{"$f":"IF(K12<>\"\",AK12,0)","v":0},{"$f":"(IF(E12>1,M12,0)*$M$6/2)+(IF(H12>1,M12,0)*$M$6/2)","v":0},{"$f":"IF(K12<>0,AH12,\"\")","v":""},{"$f":"IF(K12<>0,AW12,\"\")","v":""},null,false,null,0,null,null,null,0,{"$f":"$X$8/$Z$4","v":0},{"$f":"X12/$Z$4","v":0},{"$f":"(T12-$T$8)*2/$Z$4","v":0},{"$f":"SIN(Y12)*SIN(Z12)+COS(Y12)*COS(Z12)*COS(AA12)","v":1},{"$f":"ATAN(SQRT(1-AB12*AB12)/AB12)","v":0},{"$f":"IF(AC12<0,180/$Z$4+AC12,AC12)","v":0},{"$f":"IF(Y12<>Z12,90*(1+ABS(Y12-Z12)/(Y12-Z12)))","v":false},{"$f":"IF(AA12<>0,90+$Z$4*ATAN((SIN(Y12)*AB12-SIN(Z12))/(SIN(AA12)*COS(Y12)^2)),AE12*1)","v":0},{"$f":"IF(SIN(AA12)<0,AF12+180,AF12*1)","v":0},{"$f":"INT(AG12)","v":0},null,{"$f":"6365.11*AD12","v":0},{"$f":"IF(AJ12<5,5,INT(AJ12+0.5))","v":5},null,null,{"$f":"X12/$Z$4","v":0},{"$f":"$X$8/$Z$4","v":0},{"$f":"($T$8-T12)*2/$Z$4","v":0},{"$f":"SIN(AN12)*SIN(AO12)+COS(AN12)*COS(AO12)*COS(AP12)","v":1},{"$f":"ATAN(SQRT(1-AQ12*AQ12)/AQ12)","v":0},{"$f":"IF(AC12<0,180/$Z$4+AC12,AC12)","v":0},{"$f":"IF(AN12<>AO12,90*(1+ABS(AN12-AO12)/(AN12-AO12)))","v":false},{"$f":"IF(AP12<>0,90+$Z$4*ATAN((SIN(AN12)*AQ12-SIN(AO12))/(SIN(AP12)*COS(AN12)^2)),AT12*1)","v":0},{"$f":"IF(SIN(AP12)<0,AU12+180,AU12*1)","v":0},{"$f":"INT(AV12)","v":0},null,null,null,{"$f":"M12","v":0},{"$f":"C12","v":0},{"$f":"K12","v":0},0,0]
[null,null,null,"P",0,null,"P",0,"002",null,null,null,{"$f":"IF(K13<>\"\",AK13,0)","v":0},{"$f":"(IF(E13>1,M13,0)*$M$6/2)+(IF(H13>1,M13,0)*$M$6/2)","v":0},"","",null,false,null,0,null,null,null,0,0,0,0,1,0,0,false,0,0,0,null,0,5,null,null,0,0,0,1,0,0,false,0,0,0,null,null,null,0,0,0]
[null,null,null,"P",0,null,"P",0,"003",null,null,null,0,0,"","",null,false,null,0,null,null,null,0,0,0,0,1,0,0,false,0,0,0,null,0,5,null,null,0,0,0,1,0,0,false,0,0,0,null,null,null,0,0,0]
[null,null,null,"P",0,null,"P",0,"004",null,null,null,0,0,"","",null,false,null,0,null,null,null,0,0,0,0,1,0,0,false,0,0,0,null,0,5,null,null,0,0,0,1,0,0,false,0,0,0,null,null,null,0,0,0]
[null,null,null,"P",0,null,"P",0,"005",null,null,null,0,0,"","",null,false,null,0,null,null,null,0,0,0,0,1,0,0,false,0,0,0,null,0,5,null,null,0,0,0,1,0,0,false,0,0,0,null,null,null,0,0,0]
[null,null,null,"P",0,null,"P",0,"006",null,null,null,0,0,"","",null,false,null,0,null,null,null,0,0,0,0,1,0,0,false,0,0,0,null,0,5,null,null,0,0,0,1,0,0,false,0,0,0,null,null,null,0,0,0]
[null,null,null,"P",0,null,"P",0,"007",null,null,null,0,0,"","",null,false,null,0,null,null,null,0,0,0,0,1,0,0,false,0,0,0,null,0,5,null,null,0,0,0,1,0,0,false,0,0,0,null,null,null,0,0,0]
[null,null,null,"P",0,null,"P",0,"008",null,null,null,0,0,"","",null,false,null,0,null,null,null,0,0,0,0,1,0,0,false,0,0,0,null,0,5,null,null,0,0,0,1,0,0,false,0,0,0,null,null,null,0,0,0]
[null,null,null,"P",0,null,"P",0,"009",null,null,null,0,0,"","",null,false,null,0,null,null,null,0,0,0,0,1,0,0,false,0,0,0,null,0,5,null,null,0,0,0,1,0,0,false,0,0,0,null,null,null,0,0,0]
[null,null,null,"P",0,null,"P",0,"010",null,null,null,0,0,"","",null,false,null,0,null,null,null,0,0,0,0,1,0,0,false,0,0,0,null,0,5,null,null,0,0,0,1,0,0,false,0,0,0,null,null,null,0,0,0]
[null,null,null,"P",0,null,"P",0,"011",null,null,null,0,0,"","",null,false,null,0,null,null,null,0,0,0,0,1,0,0,false,0,0,0,null,0,5,null,null,0,0,0,1,0,0,false,0,0,0,null,null,null,0,0,0]
[null,null,null,"P",0,null,"P",0,"012",null,null,null,0,0,"","",null,false,null,0,null,null,null,0,0,0,0,1,0,0,false,0,0,0,null,0,5,null,null,0,0,0,1,0,0,false,0,0,0,null,null,null,0,0,0]
[null,null,null,"P",0,null,"P",0,"013",null,null,null,0,0,"","",null,false,null,0,null,null,null,0,0,0,0,1,0,0,false,0,0,0,null,0,5,null,null,0,0,0,1,0,0,false,0,0,0,null,null,null,0,0,0]
[null,null,null,"P",0,null,"P",0,"014",null,null,null,0,0,"","",null,false,null,0,null,null,null,0,0,0,0,1,0,0,false,0,0,0,null,0,5,null,null,0,0,0,1,0,0,false,0,0,0,null,null,null,0,0,0]
[null,null,null,"P",0,null,"P",0,"015",null,null,null,0,0,"","",null,false,null,0,null,null,null,0,0,0,0,1,0,0,false,0,0,0,null,0,5,null,null,0,0,0,1,0,0,false,0,0,0,null,null,null,0,0,0]
[null,null,null,"P",0,null,"P",0,"016",null,null,null,0,0,"","",null,false,null,0,null,null,null,0,0,0,0,1,0,0,false,0,0,0,null,0,5,null,null,0,0,0,1,0,0,false,0,0,0,null,null,null,0,0,0]
[null,null,null,"P",0,null,"P",0,"017",null,null,null,0,0,"","",null,false,null,0,null,null,null,0,0,0,0,1,0,0,false,0,0,0,null,0,5,null,null,0,0,0,1,0,0,false,0,0,0,null,null,null,0,0,0]
[null,null,null,"P",0,null,"P",0,"018",null,null,null,0,0,"","",null,false,null,0,null,null,null,0,0,0,0,1,0,0,false,0,0,0,null,0,5,null,null,0,0,0,1,0,0,false,0,0,0,null,null,null,0,0,0]
[null,null,null,"P",0,null,"P",0,"019",null,null,null,0,0,"","",null,false,null,0,null,null,null,0,0,0,0,1,0,0,false,0,0,0,null,0,5,null,null,0,0,0,1,0,0,false,0,0,0,null,null,null,0,0,0]
[null,null,null,"P",0,null,"P",0,"020",null,null,null,0,0,"","",null,false,null,0,null,null,null,0,0,0,0,1,0,0,false,0,0,0,null,0,5,null,null,0,0,0,1,0,0,false,0,0,0,null,null,null,0,0,0]
[null,null,null,"P",0,null,"P",0,"021",null,null,null,0,0,"","",null,false,null,0,null,null,null,0,0,0,0,1,0,0,false,0,0,0,null,0,5,null,null,0,0,0,1,0,0,false,0,0,0,null,null,null,0,0,0]
[null,null,null,"P",0,null,"P",0,"022",null,null,null,0,0,"","",null,false,null,0,null,null,null,0,0,0,0,1,0,0,false,0,0,0,null,0,5,null,null,0,0,0,1,0,0,false,0,0,0,null,null,null,0,0,0]
[null,null,null,"P",0,null,"P",0,"023",null,null,null,0,0,"","",null,false,null,0,null,null,null,0,0,0,0,1,0,0,false,0,0,0,null,0,5,null,null,0,0,0,1,0,0,false,0,0,0,null,null,null,0,0,0]
[null,null,null,"P",0,null,"P",0,"024",null,null,null,0,0,"","",null,false,null,0,null,null,null,0,0,0,0,1,0,0,false,0,0,0,null,0,5,null,null,0,0,0,1,0,0,false,0,0,0,null,null,null,0,0,0]
[null,null,null,"P",0,null,"P",0,"025",null,null,null,0,0,"","",null,false,null,0,null,null,null,0,0,0,0,1,0,0,false,0,0,0,null,0,5,null,null,0,0,0,1,0,0,false,0,0,0,null,null,null,0,0,0]
[null,null,null,"P",0,null,"P",0,"026",null,null,null,0,0,"","",null,false,null,0,null,null,null,0,0,0,0,1,0,0,false,0,0,0,null,0,5,null,null,0,0,0,1,0,0,false,0,0,0,null,null,null,0,0,0]
[null,null,null,"P",0,null,"P",0,"027",null,null,null,0,0,"","",null,false,null,0,null,null,null,0,0,0,0,1,0,0,false,0,0,0,null,0,5,null,null,0,0,0,1,0,0,false,0,0,0,null,null,null,0,0,0]
[null,null,null,"P",0,null,"P",0,"028",null,null,null,0,0,"","",null,false,null,0,null,null,null,0,0,0,0,1,0,0,false,0,0,0,null,0,5,null,null,0,0,0,1,0,0,false,0,0,0,null,null,null,0,0,0]
[null,null,null,"P",0,null,"P",0,"029",null,null,null,0,0,"","",null,false,null,0,null,null,null,0,0,0,0,1,0,0,false,0,0,0,null,0,5,null,null,0,0,0,1,0,0,false,0,0,0,null,null,null,0,0,0]
[null,null,null,"P",0,null,"P",0,"030",null,null,null,0,0,"","",null,false,null,0,null,null,null,0,0,0,0,1,0,0,false,0,0,0,null,0,5,null,null,0,0,0,1,0,0,false,0,0,0,null,null,null,0,0,0]
[null,null,null,"P",0,null,"P",0,"031",null,null,null,0,0,"","",null,false,null,0,null,null,null,0,0,0,0,1,0,0,false,0,0,0,null,0,5,null,null,0,0,0,1,0,0,false,0,0,0,null,null,null,0,0,0]
[null,null,null,"P",0,null,"P",0,"032",null,null,null,0,0,"","",null,false,null,0,null,null,null,0,0,0,0,1,0,0,false,0,0,0,null,0,5,null,null,0,0,0,1,0,0,false,0,0,0,null,null,null,0,0,0]
[null,null,null,"P",0,null,"P",0,"033",null,null,null,0,0,"","",null,false,null,0,null,null,null,0,0,0,0,1,0,0,false,0,0,0,null,0,5,null,null,0,0,0,1,0,0,false,0,0,0,null,null,null,0,0,0]
[null,null,null,"P",0,null,"P",0,"034",null,null,null,0,0,"","",null,false,null,0,null,null,null,0,0,0,0,1,0,0,false,0,0,0,null,0,5,null,null,0,0,0,1,0,0,false,0,0,0,null,null,null,0,0,0]
[null,null,null,"P",0,null,"P",0,"035",null,null,null,0,0,"","",null,false,null,0,null,null,null,0,0,0,0,1,0,0,false,0,0,0,null,0,5,null,null,0,0,0,1,0,0,false,0,0,0,null,null,null,0,0,0]
[null,null,null,"P",0,null,"P",0,"036",null,null,null,0,0,"","",null,false,null,0,null,null,null,0,0,0,0,1,0,0,false,0,0,0,null,0,5,null,null,0,0,0,1,0,0,false,0,0,0,null,null,null,0,0,0]
[null,null,null,"P",0,null,"P",0,"037",null,null,null,0,0,"","",null,false,null,0,null,null,null,0,0,0,0,1,0,0,false,0,0,0,null,0,5,null,null,0,0,0,1,0,0,false,0,0,0,null,null,null,0,0,0]
[null,null,null,"P",0,null,"P",0,"038",null,null,null,0,0,"","",null,false,null,0,null,null,null,0,0,0,0,1,0,0,false,0,0,0,null,0,5,null,null,0,0,0,1,0,0,false,0,0,0,null,null,null,0,0,0]
[null,null,null,"P",0,null,"P",0,"039",null,null,null,0,0,"","",null,false,null,0,null,null,null,0,0,0,0,1,0,0,false,0,0,0,null,0,5,null,null,0,0,0,1,0,0,false,0,0,0,null,null,null,0,0,0]
[null,null,null,"P",0,null,"P",0,"040",null,null,null,0,0,"","",null,false,null,0,null,null,null,0,0,0,0,1,0,0,false,0,0,0,null,0,5,null,null,0,0,0,1,0,0,false,0,0,0,null,null,null,0,0,0]
[null,null,null,"P",0,null,"P",0,"041",null,null,null,0,0,"","",null,false,null,0,null,null,null,0,0,0,0,1,0,0,false,0,0,0,null,0,5,null,null,0,0,0,1,0,0,false,0,0,0,null,null,null,0,0,0]
[null,null,null,"P",0,null,"P",0,"042",null,null,null,0,0,"","",null,false,null,0,null,null,null,0,0,0,0,1,0,0,false,0,0,0,null,0,5,null,null,0,0,0,1,0,0,false,0,0,0,null,null,null,0,0,0]
[null,null,null,"P",0,null,"P",0,"043",null,null,null,0,0,"","",null,false,null,0,null,null,null,0,0,0,0,1,0,0,false,0,0,0,null,0,5,null,null,0,0,0,1,0,0,false,0,0,0,null,null,null,0,0,0]
[null,null,null,"P",0,null,"P",0,"044",null,null,null,0,0,"","",null,false,null,0,null,null,null,0,0,0,0,1,0,0,false,0,0,0,null,0,5,null,null,0,0,0,1,0,0,false,0,0,0,null,null,null,0,0,0]
[null,null,null,"P",0,null,"P",0,"045",null,null,null,0,0,"","",null,false,null,0,null,null,null,0,0,0,0,1,0,0,false,0,0,0,null,0,5,null,null,0,0,0,1,0,0,false,0,0,0,null,null,null,0,0,0]
[null,null,null,"P",0,null,"P",0,"046",null,null,null,0,0,"","",null,false,null,0,null,null,null,0,0,0,0,1,0,0,false,0,0,0,null,0,5,null,null,0,0,0,1,0,0,false,0,0,0,null,null,null,0,0,0]
[null,null,null,"P",0,null,"P",0,"047",null,null,null,0,0,"","",null,false,null,0,null,null,null,0,0,0,0,1,0,0,false,0,0,0,null,0,5,null,null,0,0,0,1,0,0,false,0,0,0,null,null,null,0,0,0]
[null,null,null,"P",0,null,"P",0,"048",null,null,null,0,0,"","",null,false,null,0,null,null,null,0,0,0,0,1,0,0,false,0,0,0,null,0,5,null,null,0,0,0,1,0,0,false,0,0,0,null,null,null,0,0,0]
[null,null,null,"P",0,null,"P",0,"049",null,null,null,0,0,"","",null,false,null,0,null,null,null,0,0,0,0,1,0,0,false,0,0,0,null,0,5,null,null,0,0,0,1,0,0,false,0,0,0,null,null,null,0,0,0]
[null,null,null,"P",0,null,"P",0,"050",null,null,null,0,0,"","",null,false,null,0,null,null,null,0,0,0,0,1,0,0,false,0,0,0,null,0,5,null,null,0,0,0,1,0,0,false,0,0,0,null,null,null,0,0,0]
[null,null,null,null,null,null,null,null,null,null,null,null,null,null,null,null,null,null,null,null,null,null,null,null,null,null,null,null,null,null,null,null,null,null,null,null,null,null,null,null,null,null,null,null,null,null,null,null,null,null,null,null,null,null,null,0]

{"sheet":"0.2cm","index":14,"n_rows":62,"n_cols":57,"rows_kept":62,"cut":false,"hidden":false,"merged":[[5,2,5,7],[7,2,7,3],[7,9,7,10],[0,0,0,16],[7,7,7,8],[9,16,10,16],[9,1,10,1],[9,2,10,2],[9,3,10,5],[9,6,10,8],[9,9,10,9],[9,10,10,10],[9,11,10,11],[9,12,10,12],[9,13,10,13],[9,14,10,14],[9,15,10,15],[9,0,10,0],[3,6,3,8]]}
["ATV CONTEST LOG 0.2 cm"]
[]
[]
[null,null,null,null,null,null,null,null,null,null,null,{"$f":"IF(Summary!$V$3=1,\"Banda:\",\"Band:\")","v":"Banda:"},0.2,"cm",{"$f":"IF(Summary!$V$3=1,\"Analogico:\",\"Analogic\")","v":"Analogico:"},{"$f":"SUMIF($R$12:$R$61,\"=FALSO\",$N$12:$N$61)","v":0},null,null,null,null,null,null,null,null,"Deg/Rad :",{"$f":"180/PI()","v":57.295779513082323}]
[]
[{"$f":"IF(Summary!$V$3=1,\"Data:\",\"Date:\")","v":"Data:"},null,{"$f":"IF(Summary!B3=\"\",\"\",Summary!B3)","v":"2022-07-10"},null,null,null,null,null,null,null,null,{"$f":"IF(Summary!$V$3=1,\"Moltiplicatore:\",\"Multiplier:\")","v":"Moltiplicatore:"},{"$f":"Summary!$AI$49","v":10},null,{"$f":"IF(Summary!$V$3=1,\"Totale:\",\"Total:\")","v":"Totale:"},{"$f":"SUM(N12:N61)","v":0},{"$f":"IF(M4=70,1,IF(M4=24,2,IF(M4=23,2,IF(M4=13,5))))","v":false},{"$f":"IF(M4=9,\"5\",IF(M4=6,\"5\",IF(M4=3,\"5\",IF(M4=1.3,\"5\"))))","v":false},{"$f":"IF(M4=1.2,\"5\",IF(M4=0.6,\"5\",IF(M4=0.7,\"5\")))","v":false},"Longitude",null,null,null,"Latitude"]
[]
[{"$f":"IF(Summary!$V$3=1,\"Codice:\",\"Code:\")","v":"Codice:"},null,{"$f":"Summary!$B$32","v":0},null,null,null,null,{"$f":"IF(Summary!$V$3=1,\"Nominativo:\",\"Call:\")","v":"Nominativo:"},null,{"$f":"Summary!B5","v":0},null,{"$f":"IF(Summary!$V$3=1,\"Locatore WW:\",\"WW Locator:\")","v":"Locatore WW:"},{"$f":"Summary!B15","v":0},null,{"$f":"IF(Summary!$V$3=1,\"Digitale:\",\"Digital:\")","v":"Digitale:"},{"$f":"SUMIF($R$12:$R$61,\"=VERO\",$N$12:$N$61)","v":0},null,null,null,0,null,null,null,0]
[]
[{"$f":"IF(Summary!$V$3=1,\"Data\",\"Date\")","v":"Data"},{"$f":"IF(Summary!$V$3=1,\"Ora UTC\",\"Time UTC\")","v":"Ora UTC"},{"$f":"IF(Summary!$V$3=1,\"Stazioni Collegate\",\"Stations Worked\")","v":"Stazioni Collegate"},{"$f":"IF(Summary!$V$3=1,\"Rprt.+ Sequenza Ricevuta\",\"Rprt.+ Sequence Received\")","v":"Rprt.+ Sequenza Ricevuta"},null,null,{"$f":"IF(Summary!$V$3=1,\"Rpt.+ Sequenza Inviata\",\"Rpt.+ Sequence Sent\")","v":"Rpt.+ Sequenza Inviata"},null,null,{"$f":"IF(Summary!$V$3=1,\"Codice Ricevuto\",\"Code Received\")","v":"Codice Ricevuto"},{"$f":"IF(Summary!$V$3=1,\"Locatore WW\",\"WW Locator\")","v":"Locatore WW"},{"$f":"IF(Summary!$V$3=1,\"Commenti\",\"Comments\")","v":"Commenti"},{"$f":"IF(Summary!$V$3=1,\"Distanza Km\",\"Distance Km\")","v":"Distanza Km"},{"$f":"IF(Summary!$V$3=1,\"Punti\",\"Points\")","v":"Punti"},{"$f":"IF(Summary!$V$3=1,\"AZIMUT (Tuo)\",\"Heading (own)\")","v":"AZIMUT (Tuo)"},{"$f":"IF(Summary!$V$3=1,\"AZIMUT (Corrispondente)\",\"Heading (Other)\")","v":"AZIMUT (Corrispondente)"},{"$f":"IF(Summary!$V$3=1,\"DIGITALE?\",\"DIGITAL?\")","v":"DIGITALE?"},null,null,null,null,null,null,null,"Local Lat","Dist Lat","Diff Long",null,"Path Rad",null,null,null,null,null,null,null,null,null,null,"Dist Lat","Local Lat","Diff Long",null,"Path Rad",null,null,null,null,"Back"]
[null,null,null,null,null,null,null,null,null,null,null,null,null,null,null,null,null,null,null,"Longitude",null,null,null,"Latitude","A","B","L","E","D","Dcond","F1cond","F2cond","F3cond","Bearing",null,"R","Rint   km",null,null,"A","B","L","E","D","Dcond","F1cond","F2cond","F3cond","Bearing",null,null,null,"dx","call","locator","nr. QSO's","total km's"]
[null,null,null,"P",0,null,"P",0,"001",null,null,null,{"$f":"IF(K12<>\"\",AK12,0)","v":0},{"$f":"(IF(E12>1,M12,0)*$M$6/2)+(IF(H12>1,M12,0)*$M$6/2)","v":0},{"$f":"IF(K12<>0,AH12,\"\")","v":""},{"$f":"IF(K12<>0,AW12,\"\")","v":""},null,false,null,0,null,null,null,0,{"$f":"$X$8/$Z$4","v":0},{"$f":"X12/$Z$4","v":0},{"$f":"(T12-$T$8)*2/$Z$4","v":0},{"$f":"SIN(Y12)*SIN(Z12)+COS(Y12)*COS(Z12)*COS(AA12)","v":1},{"$f":"ATAN(SQRT(1-AB12*AB12)/AB12)","v":0},{"$f":"IF(AC12<0,180/$Z$4+AC12,AC12)","v":0},{"$f":"IF(Y12<>Z12,90*(1+ABS(Y12-Z12)/(Y12-Z12)))","v":false},{"$f":"IF(AA12<>0,90+$Z$4*ATAN((SIN(Y12)*AB12-SIN(Z12))/(SIN(AA12)*COS(Y12)^2)),AE12*1)","v":0},{"$f":"IF(SIN(AA12)<0,AF12+180,AF12*1)","v":0},{"$f":"INT(AG12)","v":0},null,{"$f":"6365.11*AD12","v":0},{"$f":"IF(AJ12<5,5,INT(AJ12+0.5))","v":5},null,null,{"$f":"X12/$Z$4","v":0},{"$f":"$X$8/$Z$4","v":0},{"$f":"($T$8-T12)*2/$Z$4","v":0},{"$f":"SIN(AN12)*SIN(AO12)+COS(AN12)*COS(AO12)*COS(AP12)","v":1},{"$f":"ATAN(SQRT(1-AQ12*AQ12)/AQ12)","v":0},{"$f":"IF(AC12<0,180/$Z$4+AC12,AC12)","v":0},{"$f":"IF(AN12<>AO12,90*(1+ABS(AN12-AO12)/(AN12-AO12)))","v":false},{"$f":"IF(AP12<>0,90+$Z$4*ATAN((SIN(AN12)*AQ12-SIN(AO12))/(SIN(AP12)*COS(AN12)^2)),AT12*1)","v":0},{"$f":"IF(SIN(AP12)<0,AU12+180,AU12*1)","v":0},{"$f":"INT(AV12)","v":0},null,null,null,{"$f":"M12","v":0},{"$f":"C12","v":0},{"$f":"K12","v":0},0,0]
[null,null,null,"P",0,null,"P",0,"002",null,null,null,{"$f":"IF(K13<>\"\",AK13,0)","v":0},{"$f":"(IF(E13>1,M13,0)*$M$6/2)+(IF(H13>1,M13,0)*$M$6/2)","v":0},"","",null,false,null,0,null,null,null,0,0,0,0,1,0,0,false,0,0,0,null,0,5,null,null,0,0,0,1,0,0,false,0,0,0,null,null,null,0,0,0]
[null,null,null,"P",0,null,"P",0,"003",null,null,null,0,0,"","",null,false,null,0,null,null,null,0,0,0,0,1,0,0,false,0,0,0,null,0,5,null,null,0,0,0,1,0,0,false,0,0,0,null,null,null,0,0,0]
[null,null,null,"P",0,null,"P",0,"004",null,null,null,0,0,"","",null,false,null,0,null,null,null,0,0,0,0,1,0,0,false,0,0,0,null,0,5,null,null,0,0,0,1,0,0,false,0,0,0,null,null,null,0,0,0]
[null,null,null,"P",0,null,"P",0,"005",null,null,null,0,0,"","",null,false,null,0,null,null,null,0,0,0,0,1,0,0,false,0,0,0,null,0,5,null,null,0,0,0,1,0,0,false,0,0,0,null,null,null,0,0,0]
[null,null,null,"P",0,null,"P",0,"006",null,null,null,0,0,"","",null,false,null,0,null,null,null,0,0,0,0,1,0,0,false,0,0,0,null,0,5,null,null,0,0,0,1,0,0,false,0,0,0,null,null,null,0,0,0]
[null,null,null,"P",0,null,"P",0,"007",null,null,null,0,0,"","",null,false,null,0,null,null,null,0,0,0,0,1,0,0,false,0,0,0,null,0,5,null,null,0,0,0,1,0,0,false,0,0,0,null,null,null,0,0,0]
[null,null,null,"P",0,null,"P",0,"008",null,null,null,0,0,"","",null,false,null,0,null,null,null,0,0,0,0,1,0,0,false,0,0,0,null,0,5,null,null,0,0,0,1,0,0,false,0,0,0,null,null,null,0,0,0]
[null,null,null,"P",0,null,"P",0,"009",null,null,null,0,0,"","",null,false,null,0,null,null,null,0,0,0,0,1,0,0,false,0,0,0,null,0,5,null,null,0,0,0,1,0,0,false,0,0,0,null,null,null,0,0,0]
[null,null,null,"P",0,null,"P",0,"010",null,null,null,0,0,"","",null,false,null,0,null,null,null,0,0,0,0,1,0,0,false,0,0,0,null,0,5,null,null,0,0,0,1,0,0,false,0,0,0,null,null,null,0,0,0]
[null,null,null,"P",0,null,"P",0,"011",null,null,null,0,0,"","",null,false,null,0,null,null,null,0,0,0,0,1,0,0,false,0,0,0,null,0,5,null,null,0,0,0,1,0,0,false,0,0,0,null,null,null,0,0,0]
[null,null,null,"P",0,null,"P",0,"012",null,null,null,0,0,"","",null,false,null,0,null,null,null,0,0,0,0,1,0,0,false,0,0,0,null,0,5,null,null,0,0,0,1,0,0,false,0,0,0,null,null,null,0,0,0]
[null,null,null,"P",0,null,"P",0,"013",null,null,null,0,0,"","",null,false,null,0,null,null,null,0,0,0,0,1,0,0,false,0,0,0,null,0,5,null,null,0,0,0,1,0,0,false,0,0,0,null,null,null,0,0,0]
[null,null,null,"P",0,null,"P",0,"014",null,null,null,0,0,"","",null,false,null,0,null,null,null,0,0,0,0,1,0,0,false,0,0,0,null,0,5,null,null,0,0,0,1,0,0,false,0,0,0,null,null,null,0,0,0]
[null,null,null,"P",0,null,"P",0,"015",null,null,null,0,0,"","",null,false,null,0,null,null,null,0,0,0,0,1,0,0,false,0,0,0,null,0,5,null,null,0,0,0,1,0,0,false,0,0,0,null,null,null,0,0,0]
[null,null,null,"P",0,null,"P",0,"016",null,null,null,0,0,"","",null,false,null,0,null,null,null,0,0,0,0,1,0,0,false,0,0,0,null,0,5,null,null,0,0,0,1,0,0,false,0,0,0,null,null,null,0,0,0]
[null,null,null,"P",0,null,"P",0,"017",null,null,null,0,0,"","",null,false,null,0,null,null,null,0,0,0,0,1,0,0,false,0,0,0,null,0,5,null,null,0,0,0,1,0,0,false,0,0,0,null,null,null,0,0,0]
[null,null,null,"P",0,null,"P",0,"018",null,null,null,0,0,"","",null,false,null,0,null,null,null,0,0,0,0,1,0,0,false,0,0,0,null,0,5,null,null,0,0,0,1,0,0,false,0,0,0,null,null,null,0,0,0]
[null,null,null,"P",0,null,"P",0,"019",null,null,null,0,0,"","",null,false,null,0,null,null,null,0,0,0,0,1,0,0,false,0,0,0,null,0,5,null,null,0,0,0,1,0,0,false,0,0,0,null,null,null,0,0,0]
[null,null,null,"P",0,null,"P",0,"020",null,null,null,0,0,"","",null,false,null,0,null,null,null,0,0,0,0,1,0,0,false,0,0,0,null,0,5,null,null,0,0,0,1,0,0,false,0,0,0,null,null,null,0,0,0]
[null,null,null,"P",0,null,"P",0,"021",null,null,null,0,0,"","",null,false,null,0,null,null,null,0,0,0,0,1,0,0,false,0,0,0,null,0,5,null,null,0,0,0,1,0,0,false,0,0,0,null,null,null,0,0,0]
[null,null,null,"P",0,null,"P",0,"022",null,null,null,0,0,"","",null,false,null,0,null,null,null,0,0,0,0,1,0,0,false,0,0,0,null,0,5,null,null,0,0,0,1,0,0,false,0,0,0,null,null,null,0,0,0]
[null,null,null,"P",0,null,"P",0,"023",null,null,null,0,0,"","",null,false,null,0,null,null,null,0,0,0,0,1,0,0,false,0,0,0,null,0,5,null,null,0,0,0,1,0,0,false,0,0,0,null,null,null,0,0,0]
[null,null,null,"P",0,null,"P",0,"024",null,null,null,0,0,"","",null,false,null,0,null,null,null,0,0,0,0,1,0,0,false,0,0,0,null,0,5,null,null,0,0,0,1,0,0,false,0,0,0,null,null,null,0,0,0]
[null,null,null,"P",0,null,"P",0,"025",null,null,null,0,0,"","",null,false,null,0,null,null,null,0,0,0,0,1,0,0,false,0,0,0,null,0,5,null,null,0,0,0,1,0,0,false,0,0,0,null,null,null,0,0,0]
[null,null,null,"P",0,null,"P",0,"026",null,null,null,0,0,"","",null,false,null,0,null,null,null,0,0,0,0,1,0,0,false,0,0,0,null,0,5,null,null,0,0,0,1,0,0,false,0,0,0,null,null,null,0,0,0]
[null,null,null,"P",0,null,"P",0,"027",null,null,null,0,0,"","",null,false,null,0,null,null,null,0,0,0,0,1,0,0,false,0,0,0,null,0,5,null,null,0,0,0,1,0,0,false,0,0,0,null,null,null,0,0,0]
[null,null,null,"P",0,null,"P",0,"028",null,null,null,0,0,"","",null,false,null,0,null,null,null,0,0,0,0,1,0,0,false,0,0,0,null,0,5,null,null,0,0,0,1,0,0,false,0,0,0,null,null,null,0,0,0]
[null,null,null,"P",0,null,"P",0,"029",null,null,null,0,0,"","",null,false,null,0,null,null,null,0,0,0,0,1,0,0,false,0,0,0,null,0,5,null,null,0,0,0,1,0,0,false,0,0,0,null,null,null,0,0,0]
[null,null,null,"P",0,null,"P",0,"030",null,null,null,0,0,"","",null,false,null,0,null,null,null,0,0,0,0,1,0,0,false,0,0,0,null,0,5,null,null,0,0,0,1,0,0,false,0,0,0,null,null,null,0,0,0]
[null,null,null,"P",0,null,"P",0,"031",null,null,null,0,0,"","",null,false,null,0,null,null,null,0,0,0,0,1,0,0,false,0,0,0,null,0,5,null,null,0,0,0,1,0,0,false,0,0,0,null,null,null,0,0,0]
[null,null,null,"P",0,null,"P",0,"032",null,null,null,0,0,"","",null,false,null,0,null,null,null,0,0,0,0,1,0,0,false,0,0,0,null,0,5,null,null,0,0,0,1,0,0,false,0,0,0,null,null,null,0,0,0]
[null,null,null,"P",0,null,"P",0,"033",null,null,null,0,0,"","",null,false,null,0,null,null,null,0,0,0,0,1,0,0,false,0,0,0,null,0,5,null,null,0,0,0,1,0,0,false,0,0,0,null,null,null,0,0,0]
[null,null,null,"P",0,null,"P",0,"034",null,null,null,0,0,"","",null,false,null,0,null,null,null,0,0,0,0,1,0,0,false,0,0,0,null,0,5,null,null,0,0,0,1,0,0,false,0,0,0,null,null,null,0,0,0]
[null,null,null,"P",0,null,"P",0,"035",null,null,null,0,0,"","",null,false,null,0,null,null,null,0,0,0,0,1,0,0,false,0,0,0,null,0,5,null,null,0,0,0,1,0,0,false,0,0,0,null,null,null,0,0,0]
[null,null,null,"P",0,null,"P",0,"036",null,null,null,0,0,"","",null,false,null,0,null,null,null,0,0,0,0,1,0,0,false,0,0,0,null,0,5,null,null,0,0,0,1,0,0,false,0,0,0,null,null,null,0,0,0]
[null,null,null,"P",0,null,"P",0,"037",null,null,null,0,0,"","",null,false,null,0,null,null,null,0,0,0,0,1,0,0,false,0,0,0,null,0,5,null,null,0,0,0,1,0,0,false,0,0,0,null,null,null,0,0,0]
[null,null,null,"P",0,null,"P",0,"038",null,null,null,0,0,"","",null,false,null,0,null,null,null,0,0,0,0,1,0,0,false,0,0,0,null,0,5,null,null,0,0,0,1,0,0,false,0,0,0,null,null,null,0,0,0]
[null,null,null,"P",0,null,"P",0,"039",null,null,null,0,0,"","",null,false,null,0,null,null,null,0,0,0,0,1,0,0,false,0,0,0,null,0,5,null,null,0,0,0,1,0,0,false,0,0,0,null,null,null,0,0,0]
[null,null,null,"P",0,null,"P",0,"040",null,null,null,0,0,"","",null,false,null,0,null,null,null,0,0,0,0,1,0,0,false,0,0,0,null,0,5,null,null,0,0,0,1,0,0,false,0,0,0,null,null,null,0,0,0]
[null,null,null,"P",0,null,"P",0,"041",null,null,null,0,0,"","",null,false,null,0,null,null,null,0,0,0,0,1,0,0,false,0,0,0,null,0,5,null,null,0,0,0,1,0,0,false,0,0,0,null,null,null,0,0,0]
[null,null,null,"P",0,null,"P",0,"042",null,null,null,0,0,"","",null,false,null,0,null,null,null,0,0,0,0,1,0,0,false,0,0,0,null,0,5,null,null,0,0,0,1,0,0,false,0,0,0,null,null,null,0,0,0]
[null,null,null,"P",0,null,"P",0,"043",null,null,null,0,0,"","",null,false,null,0,null,null,null,0,0,0,0,1,0,0,false,0,0,0,null,0,5,null,null,0,0,0,1,0,0,false,0,0,0,null,null,null,0,0,0]
[null,null,null,"P",0,null,"P",0,"044",null,null,null,0,0,"","",null,false,null,0,null,null,null,0,0,0,0,1,0,0,false,0,0,0,null,0,5,null,null,0,0,0,1,0,0,false,0,0,0,null,null,null,0,0,0]
[null,null,null,"P",0,null,"P",0,"045",null,null,null,0,0,"","",null,false,null,0,null,null,null,0,0,0,0,1,0,0,false,0,0,0,null,0,5,null,null,0,0,0,1,0,0,false,0,0,0,null,null,null,0,0,0]
[null,null,null,"P",0,null,"P",0,"046",null,null,null,0,0,"","",null,false,null,0,null,null,null,0,0,0,0,1,0,0,false,0,0,0,null,0,5,null,null,0,0,0,1,0,0,false,0,0,0,null,null,null,0,0,0]
[null,null,null,"P",0,null,"P",0,"047",null,null,null,0,0,"","",null,false,null,0,null,null,null,0,0,0,0,1,0,0,false,0,0,0,null,0,5,null,null,0,0,0,1,0,0,false,0,0,0,null,null,null,0,0,0]
[null,null,null,"P",0,null,"P",0,"048",null,null,null,0,0,"","",null,false,null,0,null,null,null,0,0,0,0,1,0,0,false,0,0,0,null,0,5,null,null,0,0,0,1,0,0,false,0,0,0,null,null,null,0,0,0]
[null,null,null,"P",0,null,"P",0,"049",null,null,null,0,0,"","",null,false,null,0,null,null,null,0,0,0,0,1,0,0,false,0,0,0,null,0,5,null,null,0,0,0,1,0,0,false,0,0,0,null,null,null,0,0,0]
[null,null,null,"P",0,null,"P",0,"050",null,null,null,0,0,"","",null,false,null,0,null,null,null,0,0,0,0,1,0,0,false,0,0,0,null,0,5,null,null,0,0,0,1,0,0,false,0,0,0,null,null,null,0,0,0]
[null,null,null,null,null,null,null,null,null,null,null,null,null,null,null,null,null,null,null,null,null,null,null,null,null,null,null,null,null,null,null,null,null,null,null,null,null,null,null,null,null,null,null,null,null,null,null,null,null,null,null,null,null,null,null,0]