{"text_format":"1","workbook":"xlsx","n_sheets":15,"sheets":["Instructions","Summary","6m","4m","2m","70cm","23cm","13cm","9cm","6cm","3cm","1.2cm","0.6cm","0.4cm","0.2cm"],"not_rendered":{"charts":0,"images":4,"macros":1,"external_links":0,"defined_names":15,"comments":2,"pivot_tables":0},"unopened":[],"bounds":{"document_bytes":16777216,"sheet_cells":100000,"rows_first":2000,"rows_last":500,"rows_between":2000,"halvings":0,"cell_chars":16384,"cell_head_chars":4096},"cells_cut":0,"cells_raw":0,"read":"whole","date_system":"1900"}

{"sheet":"Instructions","index":0,"n_rows":50,"n_cols":4,"rows_kept":50,"cut":false,"hidden":false,"merged":[[45,2,45,3],[6,2,6,3],[10,1,10,3],[14,1,14,3],[41,2,41,3]]}
[]
[null,"Note:"]
[null,{"$f":"IF(Summary!$V$3=1,\"Questo Log del Contest ATV può essere tradotto in altre lingue.\",\"This ATV contest log may be translated to other languages.\")","v":"Questo Log del Contest ATV può essere tradotto in altre lingue."}]
[null,{"$f":"IF(Summary!$V$3=1,\"Tuttavia, le formule e le posizioni delle celle non dovrebbero essere modificate.\",\"However, the formulas and positions of cells should not be changed.\")","v":"Tuttavia, le formule e le posizioni delle celle non dovrebbero essere modificate."}]
[]
[null,{"$f":"IF(Summary!$V$3=1,\"Gentile Concorrente,\",\"Dear Contester,\")","v":"Gentile Concorrente,"}]
[]
[null,{"$f":"IF(Summary!$V$3=1,\"Questo foglio excel deve essere utilizzato per i Log ed inviato come iscrizione al Contest ATV - Triveneto.\",\"This spreadsheet should be used to log and submit your entry for the Triveneto - ATV contest.\")","v":"Questo foglio excel deve essere utilizzato per i Log ed inviato come iscrizione al Contest ATV - Triveneto."}]
{"$rows_left_out":43}
{"sheet":"Summary","index":1,"n_rows":70,"n_cols":35,"rows_kept":70,"cut":false,"hidden":false,"merged":[[66,0,66,16],[67,0,68,16],[1,17,1,19],[16,1,16,3],[34,1,34,2],[59,1,59,4],[61,1,61,4],[14,1,14,3],[8,1,8,3],[12,1,12,3],[10,1,10,3],[2,1,2,3],[4,1,4,3],[6,1,6,3],[0,0,0,12]]}
[{"$f":"IF($V$3=1,\" SOMMARIO - 2° ATV CONTEST - Triveneto Edizione 2022\",\"2° ATV Contest Triveneto Edition 2022 - Summary\")","v":" SOMMARIO - 2° ATV CONTEST - Triveneto Edizione 2022"}]
[null,null,null,null,null,null,null,null,null,null,null,null,null,null,null,null,null,{"$f":"IF($V$3=1,\"Lingua\",\"Language\")","v":"Lingua"}]
[{"$f":"IF($V$3=1,\"Data Contest\",\"Contest Date\")","v":"Data Contest"},"2022-07-10",null,null,null,null,null,null,null,null,null,null,null,null,null,null,null,null,null,null,null,1]
[]
[{"$f":"IF($V$3=1,\"NOMINATIVO\",\"CALL\")","v":"NOMINATIVO"}]
[]
[{"$f":"IF($V$3=1,\"NOME\",\"NAME\")","v":"NOME"}]
[]
{"$rows_left_out":63}
{"sheet":"6m","index":2,"n_rows":62,"n_cols":57,"rows_kept":62,"cut":false,"hidden":false,"merged":[[5,2,5,7],[7,2,7,3],[7,9,7,10],[0,0,0,16],[7,7,7,8],[9,16,10,16],[9,1,10,1],[9,2,10,2],[9,3,10,5],[9,6,10,8],[9,9,10,9],[9,10,10,10],[9,11,10,11],[9,12,10,12],[9,13,10,13],[9,14,10,14],[9,15,10,15],[9,0,10,0],[3,6,3,8]]}
["ATV CONTEST LOG  6 m"]
[]
[]
[null,null,null,null,null,null,null,null,null,null,null,{"$f":"IF(Summary!$V$3=1,\"Banda:\",\"Band:\")","v":"Banda:"},6," m",{"$f":"IF(Summary!$V$3=1,\"Analogico:\",\"Analogic\")","v":"Analogico:"},{"$f":"SUMIF($R$12:$R$61,\"=FALSO\",$N$12:$N$61)","v":0},null,null,null,null,null,null,null,null,"Deg/Rad :",{"$f":"180/PI()","v":57.295779513082323}]
[]
[{"$f":"IF(Summary!$V$3=1,\"Data:\",\"Date:\")","v":"Data:"},null,{"$f":"IF(Summary!B3=\"\",\"\",Summary!B3)","v":"2022-07-10"},null,null,null,null,null,null,null,null,{"$f":"IF(Summary!$V$3=1,\"Moltiplicatore:\",\"Multiplier:\")","v":"Moltiplicatore:"},{"$f":"Summary!$AI$37","v":2},null,{"$f":"IF(Summary!$V$3=1,\"Totale:\",\"Total:\")","v":"Totale:"},{"$f":"SUM(N12:N61)","v":0},{"$f":"IF(M4=70,1,IF(M4=24,2,IF(M4=23,2,IF(M4=13,5))))","v":false},{"$f":"IF(M4=9,\"5\",IF(M4=6,\"5\",IF(M4=3,\"5\",IF(M4=1.3,\"5\"))))","v":"5"},{"$f":"IF(M4=1.2,\"5\",IF(M4=0.6,\"5\",IF(M4=0.7,\"5\")))","v":false},"Longitude",null,null,null,"Latitude"]
[]
[{"$f":"IF(Summary!$V$3=1,\"Codice:\",\"Code:\")","v":"Codice:"},null,{"$f":"Summary!$B$20","v":0},null,null,null,null,{"$f":"IF(Summary!$V$3=1,\"Nominativo:\",\"Call:\")","v":"Nominativo:"},null,{"$f":"Summary!B5","v":0},null,{"$f":"IF(Summary!$V$3=1,\"Locatore WW:\",\"WW Locator:\")","v":"Locatore WW:"},{"$f":"Summary!B15","v":0},null,{"$f":"IF(Summary!$V$3=1,\"Digitale:\",\"Digital:\")","v":"Digitale:"},{"$f":"SUMIF($R$12:$R$61,\"=VERO\",$N$12:$N$61)","v":0},null,null,null,0,null,null,null,0]
{"$rows_left_out":55}
{"sheet":"4m","index":3,"n_rows":62,"n_cols":57,"rows_kept":62,"cut":false,"hidden":true,"merged":[[10,3,10,5],[10,6,10,8],[0,0,0,15],[3,6,3,8],[5,2,5,7],[7,2,7,3],[7,9,7,10]]}
["ATV CONTEST LOG  4 m (UK only)"]
[]
[]
[null,null,null,null,null,null,null,null,null,null,null,"Band:",4," m",null,null,null,null,null,null,null,null,null,null,"Deg/Rad :",{"$f":"180/PI()","v":57.295779513082323}]
[]
["Date:",null,{"$f":"IF(Summary!B3=\"\",\"\",Summary!B3)","v":"2022-07-10"},null,null,null,null,null,null,null,null,"Multiplier:",2,null,"Total:",{"$f":"SUM(N12:N61)","v":0},{"$f":"IF(M4=70,1,IF(M4=24,2,IF(M4=23,2,IF(M4=13,5))))","v":false},{"$f":"IF(M4=9,\"5\",IF(M4=6,\"5\",IF(M4=3,\"5\",IF(M4=1.3,\"5\"))))","v":false},{"$f":"IF(M4=1.2,\"5\",IF(M4=0.6,\"5\",IF(M4=0.7,\"5\")))","v":false},"Longitude",null,null,null,"Latitude"]
[]
["Code: ",null,{"$f":"Summary!B19","v":"Codice a 4 cifre scelto"},null,null,null,null,null,"Call:",{"$f":"Summary!B5","v":0},null,"Locator :",{"$f":"Summary!B15","v":0},null,null,null,null,null,null,0,null,null,null,0]
{"$rows_left_out":55}
{"sheet":"2m","index":4,"n_rows":62,"n_cols":57,"rows_kept":62,"cut":false,"hidden":false,"merged":[[5,2,5,7],[7,2,7,3],[7,9,7,10],[0,0,0,16],[7,7,7,8],[9,16,10,16],[9,1,10,1],[9,2,10,2],[9,3,10,5],[9,6,10,8],[9,9,10,9],[9,10,10,10],[9,11,10,11],[9,12,10,12],[9,13,10,13],[9,14,10,14],[9,15,10,15],[9,0,10,0],[3,6,3,8]]}
["ATV CONTEST LOG  2 m"]
[]
[]
[null,null,null,null,null,null,null,null,null,null,null,{"$f":"IF(Summary!$V$3=1,\"Banda:\",\"Band:\")","v":"Banda:"},2," m",{"$f":"IF(Summary!$V$3=1,\"Analogico:\",\"Analogic\")","v":"Analogico:"},{"$f":"SUMIF($R$12:$R$61,\"=FALSO\",$N$12:$N$61)","v":0},null,null,null,null,null,null,null,null,"Deg/Rad :",{"$f":"180/PI()","v":57.295779513082323}]
[]
[{"$f":"IF(Summary!$V$3=1,\"Data:\",\"Date:\")","v":"Data:"},null,{"$f":"IF(Summary!B3=\"\",\"\",Summary!B3)","v":"2022-07-10"},null,null,null,null,null,null,null,null,{"$f":"IF(Summary!$V$3=1,\"Moltiplicatore:\",\"Multiplier:\")","v":"Moltiplicatore:"},{"$f":"Summary!$AI$39","v":2},null,{"$f":"IF(Summary!$V$3=1,\"Totale:\",\"Total:\")","v":"Totale:"},{"$f":"SUM(N12:N61)","v":0},{"$f":"IF(M4=70,1,IF(M4=24,2,IF(M4=23,2,IF(M4=13,5))))","v":false},{"$f":"IF(M4=9,\"5\",IF(M4=6,\"5\",IF(M4=3,\"5\",IF(M4=1.3,\"5\"))))","v":false},{"$f":"IF(M4=1.2,\"5\",IF(M4=0.6,\"5\",IF(M4=0.7,\"5\")))","v":false},"Longitude",null,null,null,"Latitude"]
[]
[{"$f":"IF(Summary!$V$3=1,\"Codice:\",\"Code:\")","v":"Codice:"},null,{"$f":"Summary!$B$22","v":0},null,null,null,null,{"$f":"IF(Summary!$V$3=1,\"Nominativo:\",\"Call:\")","v":"Nominativo:"},null,{"$f":"Summary!B5","v":0},null,{"$f":"IF(Summary!$V$3=1,\"Locatore WW:\",\"WW Locator:\")","v":"Locatore WW:"},{"$f":"Summary!B15","v":0},null,{"$f":"IF(Summary!$V$3=1,\"Digitale:\",\"Digital:\")","v":"Digitale:"},{"$f":"SUMIF($R$12:$R$61,\"=VERO\",$N$12:$N$61)","v":0},null,null,null,0,null,null,null,0]
{"$rows_left_out":55}
{"sheet":"70cm","index":5,"n_rows":62,"n_cols":57,"rows_kept":62,"cut":false,"hidden":false,"merged":[[7,2,7,3],[7,9,7,10],[3,6,3,8],[0,0,0,16],[7,7,7,8],[9,16,10,16],[9,1,10,1],[9,2,10,2],[9,3,10,5],[9,6,10,8],[9,9,10,9],[9,10,10,10],[9,11,10,11],[9,12,10,12],[9,13,10,13],[9,14,10,14],[9,15,10,15],[9,0,10,0],[5,2,5,7]]}
["ATV CONTEST LOG  70 cm"]
[]
[]
[null,null,null,null,null,null,null,null,null,null,null,{"$f":"IF(Summary!$V$3=1,\"Banda:\",\"Band:\")","v":"Banda:"},70,"cm",{"$f":"IF(Summary!$V$3=1,\"Analogico:\",\"Analogic\")","v":"Analogico:"},{"$f":"SUMIF($R$12:$R$61,\"=FALSO\",$N$12:$N$61)","v":0},null,null,null,null,null,null,null,null,"Deg/Rad :",{"$f":"180/PI()","v":57.295779513082323}]
[]
[{"$f":"IF(Summary!$V$3=1,\"Data:\",\"Date:\")","v":"Data:"},null,{"$f":"IF(Summary!B3=\"\",\"\",Summary!B3)","v":"2022-07-10"},null,null,null,null,null,null,null,null,{"$f":"IF(Summary!$V$3=1,\"Moltiplicatore:\",\"Multiplier:\")","v":"Moltiplicatore:"},{"$f":"Summary!$AI$40","v":8},null,{"$f":"IF(Summary!$V$3=1,\"Totale:\",\"Total:\")","v":"Totale:"},{"$f":"SUM(N12:N61)","v":0},{"$f":"IF(M4=70,1,IF(M4=24,2,IF(M4=23,2,IF(M4=13,5))))","v":1},{"$f":"IF(M4=9,\"5\",IF(M4=6,\"5\",IF(M4=3,\"5\",IF(M4=1.3,\"5\"))))","v":false},{"$f":"IF(M4=1.2,\"5\",IF(M4=0.6,\"5\",IF(M4=0.7,\"5\")))","v":false},"Longitude",null,null,null,"Latitude"]
[]
[{"$f":"IF(Summary!$V$3=1,\"Codice:\",\"Code:\")","v":"Codice:"},null,{"$f":"Summary!$B$23","v":0},null,null,null,null,{"$f":"IF(Summary!$V$3=1,\"Nominativo:\",\"Call:\")","v":"Nominativo:"},null,{"$f":"Summary!B5","v":0},null,{"$f":"IF(Summary!$V$3=1,\"Locatore WW:\",\"WW Locator:\")","v":"Locatore WW:"},{"$f":"Summary!B15","v":0},null,{"$f":"IF(Summary!$V$3=1,\"Digitale:\",\"Digital:\")","v":"Digitale:"},{"$f":"SUMIF($R$12:$R$61,\"=VERO\",$N$12:$N$61)","v":0},null,null,null,0,null,null,null,0]
{"$rows_left_out":55}
{"sheet":"23cm","index":6,"n_rows":62,"n_cols":57,"rows_kept":62,"cut":false,"hidden":false,"merged":[[7,2,7,3],[7,9,7,10],[3,6,3,8],[0,0,0,16],[7,7,7,8],[9,16,10,16],[9,1,10,1],[9,2,10,2],[9,3,10,5],[9,6,10,8],[9,9,10,9],[9,10,10,10],[9,11,10,11],[9,12,10,12],[9,13,10,13],[9,14,10,14],[9,15,10,15],[9,0,10,0],[5,2,5,7]]}
["ATV CONTEST LOG 23 cm"]
[]
[]
[null,null,null,null,null,null,null,null,null,null,null,{"$f":"IF(Summary!$V$3=1,\"Banda:\",\"Band:\")","v":"Banda:"},23,"cm",{"$f":"IF(Summary!$V$3=1,\"Analogico:\",\"Analogic\")","v":"Analogico:"},{"$f":"SUMIF($R$12:$R$61,\"=FALSO\",$N$12:$N$61)","v":0},null,null,null,null,null,null,null,null,"Deg/Rad :",{"$f":"180/PI()","v":57.295779513082323}]
[]
[{"$f":"IF(Summary!$V$3=1,\"Data:\",\"Date:\")","v":"Data:"},null,{"$f":"IF(Summary!B3=\"\",\"\",Summary!B3)","v":"2022-07-10"},null,null,null,null,null,null,null,null,{"$f":"IF(Summary!$V$3=1,\"Moltiplicatore:\",\"Multiplier:\")","v":"Moltiplicatore:"},{"$f":"Summary!$AI$41","v":2},null,{"$f":"IF(Summary!$V$3=1,\"Totale:\",\"Total:\")","v":"Totale:"},{"$f":"SUM(N12:N61)","v":0},{"$f":"IF(M4=70,1,IF(M4=24,2,IF(M4=23,2,IF(M4=13,5))))","v":2},{"$f":"IF(M4=9,\"5\",IF(M4=6,\"5\",IF(M4=3,\"5\",IF(M4=1.3,\"5\"))))","v":false},{"$f":"IF(M4=1.2,\"5\",IF(M4=0.6,\"5\",IF(M4=0.7,\"5\")))","v":false},"Longitude",null,null,null,"Latitude"]
[]
[{"$f":"IF(Summary!$V$3=1,\"Codice:\",\"Code:\")","v":"Codice:"},null,{"$f":"Summary!$B$24","v":0},null,null,null,null,{"$f":"IF(Summary!$V$3=1,\"Nominativo:\",\"Call:\")","v":"Nominativo:"},null,{"$f":"Summary!B5","v":0},null,{"$f":"IF(Summary!$V$3=1,\"Locatore WW:\",\"WW Locator:\")","v":"Locatore WW:"},{"$f":"Summary!B15","v":0},null,{"$f":"IF(Summary!$V$3=1,\"Digitale:\",\"Digital:\")","v":"Digitale:"},{"$f":"SUMIF($R$12:$R$61,\"=VERO\",$N$12:$N$61)","v":0},null,null,null,0,null,null,null,0]
{"$rows_left_out":55}
{"sheet":"13cm","index":7,"n_rows":62,"n_cols":57,"rows_kept":62,"cut":false,"hidden":false,"merged":[[7,2,7,3],[7,9,7,10],[3,6,3,8],[0,0,0,16],[7,7,7,8],[9,16,10,16],[9,1,10,1],[9,2,10,2],[9,3,10,5],[9,6,10,8],[9,9,10,9],[9,10,10,10],[9,11,10,11],[9,12,10,12],[9,13,10,13],[9,14,10,14],[9,15,10,15],[9,0,10,0],[5,2,5,7]]}
["ATV CONTEST LOG 13 cm"]
[]
[]
[null,null,null,null,null,null,null,null,null,null,null,{"$f":"IF(Summary!$V$3=1,\"Banda:\",\"Band:\")","v":"Banda:"},13,"cm",{"$f":"IF(Summary!$V$3=1,\"Analogico:\",\"Analogic\")","v":"Analogico:"},{"$f":"SUMIF($R$12:$R$61,\"=FALSO\",$N$12:$N$61)","v":0},null,null,null,null,null,null,null,null,"Deg/Rad :",{"$f":"180/PI()","v":57.295779513082323}]
[]
[{"$f":"IF(Summary!$V$3=1,\"Data:\",\"Date:\")","v":"Data:"},null,{"$f":"IF(Summary!B3=\"\",\"\",Summary!B3)","v":"2022-07-10"},null,null,null,null,null,null,null,null,{"$f":"IF(Summary!$V$3=1,\"Moltiplicatore:\",\"Multiplier:\")","v":"Moltiplicatore:"},{"$f":"Summary!AI42","v":4},null,{"$f":"IF(Summary!$V$3=1,\"Totale:\",\"Total:\")","v":"Totale:"},{"$f":"SUM(N12:N61)","v":0},{"$f":"IF(M4=70,1,IF(M4=24,2,IF(M4=23,2,IF(M4=13,5))))","v":5},{"$f":"IF(M4=9,\"5\",IF(M4=6,\"5\",IF(M4=3,\"5\",IF(M4=1.3,\"5\"))))","v":false},{"$f":"IF(M4=1.2,\"5\",IF(M4=0.6,\"5\",IF(M4=0.7,\"5\")))","v":false},"Longitude",null,null,null,"Latitude"]
[]
[{"$f":"IF(Summary!$V$3=1,\"Codice:\",\"Code:\")","v":"Codice:"},null,{"$f":"Summary!$B$25","v":0},null,null,null,null,{"$f":"IF(Summary!$V$3=1,\"Nominativo:\",\"Call:\")","v":"Nominativo:"},null,{"$f":"Summary!B5","v":0},null,{"$f":"IF(Summary!$V$3=1,\"Locatore WW:\",\"WW Locator:\")","v":"Locatore WW:"},{"$f":"Summary!B15","v":0},null,{"$f":"IF(Summary!$V$3=1,\"Digitale:\",\"Digital:\")","v":"Digitale:"},{"$f":"SUMIF($R$12:$R$61,\"=VERO\",$N$12:$N$61)","v":0},null,null,null,0,null,null,null,0]
{"$rows_left_out":55}
{"sheet":"9cm","index":8,"n_rows":62,"n_cols":57,"rows_kept":62,"cut":false,"hidden":false,"merged":[[5,2,5,7],[7,2,7,3],[7,9,7,10],[0,0,0,16],[7,7,7,8],[9,16,10,16],[9,1,10,1],[9,2,10,2],[9,3,10,5],[9,6,10,8],[9,9,10,9],[9,10,10,10],[9,11,10,11],[9,12,10,12],[9,13,10,13],[9,14,10,14],[9,15,10,15],[9,0,10,0],[3,6,3,8]]}
["ATV CONTEST LOG 9 cm"]
[]
[]
[null,null,null,null,null,null,null,null,null,null,null,{"$f":"IF(Summary!$V$3=1,\"Banda:\",\"Band:\")","v":"Banda:"},9,"cm",{"$f":"IF(Summary!$V$3=1,\"Analogico:\",\"Analogic\")","v":"Analogico:"},{"$f":"SUMIF($R$12:$R$61,\"=FALSO\",$N$12:$N$61)","v":0},null,null,null,null,null,null,null,null,"Deg/Rad :",{"$f":"180/PI()","v":57.295779513082323}]
[]
[{"$f":"IF(Summary!$V$3=1,\"Data:\",\"Date:\")","v":"Data:"},null,{"$f":"IF(Summary!B3=\"\",\"\",Summary!B3)","v":"2022-07-10"},null,null,null,null,null,null,null,null,{"$f":"IF(Summary!$V$3=1,\"Moltiplicatore:\",\"Multiplier:\")","v":"Moltiplicatore:"},{"$f":"Summary!$AI$43","v":8},null,{"$f":"IF(Summary!$V$3=1,\"Totale:\",\"Total:\")","v":"Totale:"},{"$f":"SUM(N12:N61)","v":0},{"$f":"IF(M4=70,1,IF(M4=24,2,IF(M4=23,2,IF(M4=13,5))))","v":false},{"$f":"IF(M4=9,\"5\",IF(M4=6,\"5\",IF(M4=3,\"5\",IF(M4=1.3,\"5\"))))","v":"5"},{"$f":"IF(M4=1.2,\"5\",IF(M4=0.6,\"5\",IF(M4=0.7,\"5\")))","v":false},"Longitude",null,null,null,"Latitude"]
[]
[{"$f":"IF(Summary!$V$3=1,\"Codice:\",\"Code:\")","v":"Codice:"},null,{"$f":"Summary!$B$26","v":0},null,null,null,null,{"$f":"IF(Summary!$V$3=1,\"Nominativo:\",\"Call:\")","v":"Nominativo:"},null,{"$f":"Summary!B5","v":0},null,{"$f":"IF(Summary!$V$3=1,\"Locatore WW:\",\"WW Locator:\")","v":"Locatore WW:"},{"$f":"Summary!B15","v":0},null,{"$f":"IF(Summary!$V$3=1,\"Digitale:\",\"Digital:\")","v":"Digitale:"},{"$f":"SUMIF($R$12:$R$61,\"=VERO\",$N$12:$N$61)","v":0},null,null,null,0,null,null,null,0]
{"$rows_left_out":55}
{"sheet":"6cm","index":9,"n_rows":62,"n_cols":57,"rows_kept":62,"cut":false,"hidden":false,"merged":[[5,2,5,7],[7,2,7,3],[7,9,7,10],[0,0,0,16],[7,7,7,8],[9,16,10,16],[9,1,10,1],[9,2,10,2],[9,3,10,5],[9,6,10,8],[9,9,10,9],[9,10,10,10],[9,11,10,11],[9,12,10,12],[9,13,10,13],[9,14,10,14],[9,15,10,15],[9,0,10,0],[3,6,3,8]]}
["ATV CONTEST LOG 6 cm"]
[]
[]
[null,null,null,null,null,null,null,null,null,null,null,{"$f":"IF(Summary!$V$3=1,\"Banda:\",\"Band:\")","v":"Banda:"},6,"cm",{"$f":"IF(Summary!$V$3=1,\"Analogico:\",\"Analogic\")","v":"Analogico:"},{"$f":"SUMIF($R$12:$R$61,\"=FALSO\",$N$12:$N$61)","v":0},null,null,null,null,null,null,null,null,"Deg/Rad :",{"$f":"180/PI()","v":57.295779513082323}]
[]
[{"$f":"IF(Summary!$V$3=1,\"Data:\",\"Date:\")","v":"Data:"},null,{"$f":"IF(Summary!B3=\"\",\"\",Summary!B3)","v":"2022-07-10"},null,null,null,null,null,null,null,null,{"$f":"IF(Summary!$V$3=1,\"Moltiplicatore:\",\"Multiplier:\")","v":"Moltiplicatore:"},{"$f":"Summary!$AI$44","v":8},null,{"$f":"IF(Summary!$V$3=1,\"Totale:\",\"Total:\")","v":"Totale:"},{"$f":"SUM(N12:N61)","v":0},{"$f":"IF(M4=70,1,IF(M4=24,2,IF(M4=23,2,IF(M4=13,5))))","v":false},{"$f":"IF(M4=9,\"5\",IF(M4=6,\"5\",IF(M4=3,\"5\",IF(M4=1.3,\"5\"))))","v":"5"},{"$f":"IF(M4=1.2,\"5\",IF(M4=0.6,\"5\",IF(M4=0.7,\"5\")))","v":false},"Longitude",null,null,null,"Latitude"]
[]
[{"$f":"IF(Summary!$V$3=1,\"Codice:\",\"Code:\")","v":"Codice:"},null,{"$f":"Summary!B27","v":0},null,null,null,null,{"$f":"IF(Summary!$V$3=1,\"Nominativo:\",\"Call:\")","v":"Nominativo:"},null,{"$f":"Summary!B5","v":0},null,{"$f":"IF(Summary!$V$3=1,\"Locatore WW:\",\"WW Locator:\")","v":"Locatore WW:"},{"$f":"Summary!B15","v":0},null,{"$f":"IF(Summary!$V$3=1,\"Digitale:\",\"Digital:\")","v":"Digitale:"},{"$f":"SUMIF($R$12:$R$61,\"=VERO\",$N$12:$N$61)","v":0},null,null,null,0,null,null,null,0]
{"$rows_left_out":55}
{"sheet":"3cm","index":10,"n_rows":62,"n_cols":57,"rows_kept":62,"cut":false,"hidden":false,"merged":[[7,2,7,3],[7,9,7,10],[3,6,3,8],[0,0,0,16],[7,7,7,8],[9,16,10,16],[9,1,10,1],[9,2,10,2],[9,3,10,5],[9,6,10,8],[9,9,10,9],[9,10,10,10],[9,11,10,11],[9,12,10,12],[9,13,10,13],[9,14,10,14],[9,15,10,15],[9,0,10,0],[5,2,5,7]]}
["ATV CONTEST LOG 3 cm"]
[]
[]
[null,null,null,null,null,null,null,null,null,null,null,{"$f":"IF(Summary!$V$3=1,\"Banda:\",\"Band:\")","v":"Banda:"},3,"cm",{"$f":"IF(Summary!$V$3=1,\"Analogico:\",\"Analogic\")","v":"Analogico:"},{"$f":"SUMIF($R$12:$R$61,\"=FALSO\",$N$12:$N$61)","v":0},null,null,null,null,null,null,null,null,"Deg/Rad :",{"$f":"180/PI()","v":57.295779513082323}]
[]
[{"$f":"IF(Summary!$V$3=1,\"Data:\",\"Date:\")","v":"Data:"},null,{"$f":"IF(Summary!B3=\"\",\"\",Summary!B3)","v":"2022-07-10"},null,null,null,null,null,null,null,null,{"$f":"IF(Summary!$V$3=1,\"Moltiplicatore:\",\"Multiplier:\")","v":"Moltiplicatore:"},{"$f":"Summary!$AI$45","v":8},null,{"$f":"IF(Summary!$V$3=1,\"Totale:\",\"Total:\")","v":"Totale:"},{"$f":"SUM(N12:N61)","v":0},{"$f":"IF(M4=70,1,IF(M4=24,2,IF(M4=23,2,IF(M4=13,5))))","v":false},{"$f":"IF(M4=9,\"5\",IF(M4=6,\"5\",IF(M4=3,\"5\",IF(M4=1.3,\"5\"))))","v":"5"},{"$f":"IF(M4=1.2,\"5\",IF(M4=0.6,\"5\",IF(M4=0.7,\"5\")))","v":false},"Longitude",null,null,null,"Latitude"]
[]
[{"$f":"IF(Summary!$V$3=1,\"Codice:\",\"Code:\")","v":"Codice:"},null,{"$f":"Summary!$B$28","v":0},null,null,null,null,{"$f":"IF(Summary!$V$3=1,\"Nominativo:\",\"Call:\")","v":"Nominativo:"},null,{"$f":"Summary!B5","v":0},null,{"$f":"IF(Summary!$V$3=1,\"Locatore WW:\",\"WW Locator:\")","v":"Locatore WW:"},{"$f":"Summary!B15","v":0},null,{"$f":"IF(Summary!$V$3=1,\"Digitale:\",\"Digital:\")","v":"Digitale:"},{"$f":"SUMIF($R$12:$R$61,\"=VERO\",$N$12:$N$61)","v":0},null,null,null,0,null,null,null,0]
{"$rows_left_out":55}
{"sheet":"1.2cm","index":11,"n_rows":62,"n_cols":57,"rows_kept":62,"cut":false,"hidden":false,"merged":[[7,2,7,3],[7,9,7,10],[3,6,3,8],[0,0,0,16],[7,7,7,8],[9,16,10,16],[9,1,10,1],[9,2,10,2],[9,3,10,5],[9,6,10,8],[9,9,10,9],[9,10,10,10],[9,11,10,11],[9,12,10,12],[9,13,10,13],[9,14,10,14],[9,15,10,15],[9,0,10,0],[5,2,5,7]]}
["ATV CONTEST LOG 1.2 cm"]
[]
[]
[null,null,null,null,null,null,null,null,null,null,null,{"$f":"IF(Summary!$V$3=1,\"Banda:\",\"Band:\")","v":"Banda:"},1.2,"cm",{"$f":"IF(Summary!$V$3=1,\"Analogico:\",\"Analogic\")","v":"Analogico:"},{"$f":"SUMIF($R$12:$R$61,\"=FALSO\",$N$12:$N$61)","v":0},null,null,null,null,null,null,null,null,"Deg/Rad :",{"$f":"180/PI()","v":57.295779513082323}]
[]
[{"$f":"IF(Summary!$V$3=1,\"Data:\",\"Date:\")","v":"Data:"},null,{"$f":"IF(Summary!B3=\"\",\"\",Summary!B3)","v":"2022-07-10"},null,null,null,null,null,null,null,null,{"$f":"IF(Summary!$V$3=1,\"Moltiplicatore:\",\"Multiplier:\")","v":"Moltiplicatore:"},{"$f":"Summary!$AI$46","v":10},null,{"$f":"IF(Summary!$V$3=1,\"Totale:\",\"Total:\")","v":"Totale:"},{"$f":"SUM(N12:N61)","v":0},{"$f":"IF(M4=70,1,IF(M4=24,2,IF(M4=23,2,IF(M4=13,5))))","v":false},{"$f":"IF(M4=9,\"5\",IF(M4=6,\"5\",IF(M4=3,\"5\",IF(M4=1.3,\"5\"))))","v":false},{"$f":"IF(M4=1.2,\"5\",IF(M4=0.6,\"5\",IF(M4=0.7,\"5\")))","v":"5"},"Longitude",null,null,null,"Latitude"]
[]
[{"$f":"IF(Summary!$V$3=1,\"Codice:\",\"Code:\")","v":"Codice:"},null,{"$f":"Summary!$B$29","v":0},null,null,null,null,{"$f":"IF(Summary!$V$3=1,\"Nominativo:\",\"Call:\")","v":"Nominativo:"},null,{"$f":"Summary!B5","v":0},null,{"$f":"IF(Summary!$V$3=1,\"Locatore WW:\",\"WW Locator:\")","v":"Locatore WW:"},{"$f":"Summary!B15","v":0},null,{"$f":"IF(Summary!$V$3=1,\"Digitale:\",\"Digital:\")","v":"Digitale:"},{"$f":"SUMIF($R$12:$R$61,\"=VERO\",$N$12:$N$61)","v":0},null,null,null,0,null,null,null,0]
{"$rows_left_out":55}
{"sheet":"0.6cm","index":12,"n_rows":62,"n_cols":57,"rows_kept":62,"cut":false,"hidden":false,"merged":[[5,2,5,7],[7,2,7,3],[7,9,7,10],[0,0,0,16],[7,7,7,8],[9,16,10,16],[9,1,10,1],[9,2,10,2],[9,3,10,5],[9,6,10,8],[9,9,10,9],[9,10,10,10],[9,11,10,11],[9,12,10,12],[9,13,10,13],[9,14,10,14],[9,15,10,15],[9,0,10,0],[3,6,3,8]]}
["ATV CONTEST LOG 0.6 cm"]
[]
[]
[null,null,null,null,null,null,null,null,null,null,null,{"$f":"IF(Summary!$V$3=1,\"Banda:\",\"Band:\")","v":"Banda:"},0.6,"cm",{"$f":"IF(Summary!$V$3=1,\"Analogico:\",\"Analogic\")","v":"Analogico:"},{"$f":"SUMIF($R$12:$R$61,\"=FALSO\",$N$12:$N$61)","v":0},null,null,null,null,null,null,null,null,"Deg/Rad :",{"$f":"180/PI()","v":57.295779513082323}]
[]
[{"$f":"IF(Summary!$V$3=1,\"Data:\",\"Date:\")","v":"Data:"},null,{"$f":"IF(Summary!B3=\"\",\"\",Summary!B3)","v":"2022-07-10"},null,null,null,null,null,null,null,null,{"$f":"IF(Summary!$V$3=1,\"Moltiplicatore:\",\"Multiplier:\")","v":"Moltiplicatore:"},{"$f":"Summary!$AI$46","v":10},null,{"$f":"IF(Summary!$V$3=1,\"Totale:\",\"Total:\")","v":"Totale:"},{"$f":"SUM(N12:N61)","v":0},{"$f":"IF(M4=70,1,IF(M4=24,2,IF(M4=23,2,IF(M4=13,5))))","v":false},{"$f":"IF(M4=9,\"5\",IF(M4=6,\"5\",IF(M4=3,\"5\",IF(M4=1.3,\"5\"))))","v":false},{"$f":"IF(M4=1.2,\"5\",IF(M4=0.6,\"5\",IF(M4=0.7,\"5\")))","v":"5"},"Longitude",null,null,null,"Latitude"]
[]
[{"$f":"IF(Summary!$V$3=1,\"Codice:\",\"Code:\")","v":"Codice:"},null,{"$f":"Summary!B30","v":0},null,null,null,null,{"$f":"IF(Summary!$V$3=1,\"Nominativo:\",\"Call:\")","v":"Nominativo:"},null,{"$f":"Summary!B5","v":0},null,{"$f":"IF(Summary!$V$3=1,\"Locatore WW:\",\"WW Locator:\")","v":"Locatore WW:"},{"$f":"Summary!B15","v":0},null,{"$f":"IF(Summary!$V$3=1,\"Digitale:\",\"Digital:\")","v":"Digitale:"},{"$f":"SUMIF($R$12:$R$61,\"=VERO\",$N$12:$N$61)","v":0},null,null,null,0,null,null,null,0]
{"$rows_left_out":55}
{"sheet":"0.4cm","index":13,"n_rows":62,"n_cols":57,"rows_kept":62,"cut":false,"hidden":false,"merged":[[5,2,5,7],[7,2,7,3],[7,9,7,10],[0,0,0,16],[7,7,7,8],[9,16,10,16],[9,1,10,1],[9,2,10,2],[9,3,10,5],[9,6,10,8],[9,9,10,9],[9,10,10,10],[9,11,10,11],[9,12,10,12],[9,13,10,13],[9,14,10,14],[9,15,10,15],[9,0,10,0],[3,6,3,8]]}
["ATV CONTEST LOG 0.4 cm"]
[]
[]
[null,null,null,null,null,null,null,null,null,null,null,{"$f":"IF(Summary!$V$3=1,\"Banda:\",\"Band:\")","v":"Banda:"},0.4,"cm",{"$f":"IF(Summary!$V$3=1,\"Analogico:\",\"Analogic\")","v":"Analogico:"},{"$f":"SUMIF($R$12:$R$61,\"=FALSO\",$N$12:$N$61)","v":0},null,null,null,null,null,null,null,null,"Deg/Rad :",{"$f":"180/PI()","v":57.295779513082323}]
[]
[{"$f":"IF(Summary!$V$3=1,\"Data:\",\"Date:\")","v":"Data:"},null,{"$f":"IF(Summary!B3=\"\",\"\",Summary!B3)","v":"2022-07-10"},null,null,null,null,null,null,null,null,{"$f":"IF(Summary!$V$3=1,\"Moltiplicatore:\",\"Multiplier:\")","v":"Moltiplicatore:"},{"$f":"Summary!$AI$48","v":10},null,{"$f":"IF(Summary!$V$3=1,\"Totale:\",\"Total:\")","v":"Totale:"},{"$f":"SUM(N12:N61)","v":0},{"$f":"IF(M4=70,1,IF(M4=24,2,IF(M4=23,2,IF(M4=13,5))))","v":false},{"$f":"IF(M4=9,\"5\",IF(M4=6,\"5\",IF(M4=3,\"5\",IF(M4=1.3,\"5\"))))","v":false},{"$f":"IF(M4=1.2,\"5\",IF(M4=0.6,\"5\",IF(M4=0.7,\"5\")))","v":false},"Longitude",null,null,null,"Latitude"]
[]
[{"$f":"IF(Summary!$V$3=1,\"Codice:\",\"Code:\")","v":"Codice:"},null,{"$f":"Summary!$B$31","v":0},null,null,null,null,{"$f":"IF(Summary!$V$3=1,\"Nominativo:\",\"Call:\")","v":"Nominativo:"},null,{"$f":"Summary!B5","v":0},null,{"$f":"IF(Summary!$V$3=1,\"Locatore WW:\",\"WW Locator:\")","v":"Locatore WW:"},{"$f":"Summary!B15","v":0},null,{"$f":"IF(Summary!$V$3=1,\"Digitale:\",\"Digital:\")","v":"Digitale:"},{"$f":"SUMIF($R$12:$R$61,\"=VERO\",$N$12:$N$61)","v":0},null,null,null,0,null,null,null,0]
{"$rows_left_out":55}
{"sheet":"0.2cm","index":14,"n_rows":62,"n_cols":57,"rows_kept":62,"cut":false,"hidden":false,"merged":[[5,2,5,7],[7,2,7,3],[7,9,7,10],[0,0,0,16],[7,7,7,8],[9,16,10,16],[9,1,10,1],[9,2,10,2],[9,3,10,5],[9,6,10,8],[9,9,10,9],[9,10,10,10],[9,11,10,11],[9,12,10,12],[9,13,10,13],[9,14,10,14],[9,15,10,15],[9,0,10,0],[3,6,3,8]]}
["ATV CONTEST LOG 0.2 cm"]
[]
[]
[null,null,null,null,null,null,null,null,null,null,null,{"$f":"IF(Summary!$V$3=1,\"Banda:\",\"Band:\")","v":"Banda:"},0.2,"cm",{"$f":"IF(Summary!$V$3=1,\"Analogico:\",\"Analogic\")","v":"Analogico:"},{"$f":"SUMIF($R$12:$R$61,\"=FALSO\",$N$12:$N$61)","v":0},null,null,null,null,null,null,null,null,"Deg/Rad :",{"$f":"180/PI()","v":57.295779513082323}]
[]
[{"$f":"IF(Summary!$V$3=1,\"Data:\",\"Date:\")","v":"Data:"},null,{"$f":"IF(Summary!B3=\"\",\"\",Summary!B3)","v":"2022-07-10"},null,null,null,null,null,null,null,null,{"$f":"IF(Summary!$V$3=1,\"Moltiplicatore:\",\"Multiplier:\")","v":"Moltiplicatore:"},{"$f":"Summary!$AI$49","v":10},null,{"$f":"IF(Summary!$V$3=1,\"Totale:\",\"Total:\")","v":"Totale:"},{"$f":"SUM(N12:N61)","v":0},{"$f":"IF(M4=70,1,IF(M4=24,2,IF(M4=23,2,IF(M4=13,5))))","v":false},{"$f":"IF(M4=9,\"5\",IF(M4=6,\"5\",IF(M4=3,\"5\",IF(M4=1.3,\"5\"))))","v":false},{"$f":"IF(M4=1.2,\"5\",IF(M4=0.6,\"5\",IF(M4=0.7,\"5\")))","v":false},"Longitude",null,null,null,"Latitude"]
[]
[{"$f":"IF(Summary!$V$3=1,\"Codice:\",\"Code:\")","v":"Codice:"},null,{"$f":"Summary!$B$32","v":0},null,null,null,null,{"$f":"IF(Summary!$V$3=1,\"Nominativo:\",\"Call:\")","v":"Nominativo:"},null,{"$f":"Summary!B5","v":0},null,{"$f":"IF(Summary!$V$3=1,\"Locatore WW:\",\"WW Locator:\")","v":"Locatore WW:"},{"$f":"Summary!B15","v":0},null,{"$f":"IF(Summary!$V$3=1,\"Digitale:\",\"Digital:\")","v":"Digitale:"},{"$f":"SUMIF($R$12:$R$61,\"=VERO\",$N$12:$N$61)","v":0},null,null,null,0,null,null,null,0]
{"$rows_left_out":54}